Build of aria2 with vanilla toolchain

The build took 00h 04m 19s and was SUCCESSFUL.

The program in this build is written in the following languages, according to sloccount:

SLOCLanguage
112,935 cpp
13,062 makefile
8,575 ansic
4,864 sh
305 python
58 asm
16 sed
139,815 total

The process tree of the build process is here.

Log

To avoid scrolling, you may jump to the last line of the invocation of makepkg that was used to build this package.

Removed vanilla repositories from pacman.conf and added:
# [tuscan]
# Server = file:///var/cache/pacman/pkg/

CMD: pacman -Syy --noconfirm
# :: Synchronizing package databases...
# downloading tuscan.db...

CMD: sudo -u tuscan red makepkg --noextract --syncdeps --skipinteg --skippgpcheck --skipchecksums --noconfirm --nocolor --log --noprogressbar --nocheck
# ==> Making package: aria2 1.24.0-1 (Wed Aug 24 14:19:43 UTC 2016)
# ==> Checking runtime dependencies...
# ==> Installing missing dependencies...
# resolving dependencies...
# looking for conflicting packages...
#
# Packages (1) c-ares-1.11.0-1
#
# Total Installed Size: 0.16 MiB
#
# :: Proceed with installation? [Y/n]
# checking keyring...
# checking package integrity...
# loading package files...
# checking for file conflicts...
# checking available disk space...
# :: Processing package changes...
# installing c-ares...
# :: Running post-transaction hooks...
# (1/1) Updating manpage index...
# ==> Checking buildtime dependencies...
# ==> WARNING: Using existing $srcdir/ tree
# ==> Starting build()...
# checking build system type... x86_64-pc-linux-gnu
# checking host system type... x86_64-unknown-linux-gnu
# checking target system type... x86_64-unknown-linux-gnu
# checking for a BSD-compatible install... /usr/bin/install -c
# checking whether build environment is sane... yes
# checking for x86_64-unknown-linux-strip... no
# checking for strip... strip
# checking for a thread-safe mkdir -p... /usr/bin/mkdir -p
# checking for gawk... gawk
# checking whether make sets $(MAKE)... yes
# checking whether make supports nested variables... yes
# checking whether make supports nested variables... (cached) yes
# checking for style of include used by make... GNU
# checking for x86_64-unknown-linux-gcc... no
# checking for gcc... gcc
# checking whether the C compiler works... yes
# checking for C compiler default output file name... a.out
# checking for suffix of executables...
# checking whether we are cross compiling... no
# checking for suffix of object files... o
# checking whether we are using the GNU C compiler... yes
# checking whether gcc accepts -g... yes
# checking for gcc option to accept ISO C89... none needed
# checking whether gcc understands -c and -o together... yes
# checking dependency style of gcc... gcc3
# checking how to run the C preprocessor... gcc -E
# checking for grep that handles long lines and -e... /usr/bin/grep
# checking for egrep... /usr/bin/grep -E
# checking for ANSI C header files... yes
# checking for sys/types.h... yes
# checking for sys/stat.h... yes
# checking for stdlib.h... yes
# checking for string.h... yes
# checking for memory.h... yes
# checking for strings.h... yes
# checking for inttypes.h... yes
# checking for stdint.h... yes
# checking for unistd.h... yes
# checking minix/config.h usability... no
# checking minix/config.h presence... no
# checking for minix/config.h... no
# checking whether it is safe to define __EXTENSIONS__... yes
# checking how to print strings... printf
# checking for a sed that does not truncate output... /usr/bin/sed
# checking for fgrep... /usr/bin/grep -F
# checking for ld used by gcc... /usr/bin/ld
# checking if the linker (/usr/bin/ld) is GNU ld... yes
# checking for BSD- or MS-compatible name lister (nm)... no
# checking for x86_64-unknown-linux-dumpbin... no
# checking for x86_64-unknown-linux-link... no
# checking for dumpbin... no
# checking for link... link -dump
# checking the name lister (nm) interface... BSD nm
# checking whether ln -s works... yes
# checking the maximum length of command line arguments... 1572864
# checking how to convert x86_64-pc-linux-gnu file names to x86_64-unknown-linux-gnu format... func_convert_file_noop
# checking how to convert x86_64-pc-linux-gnu file names to toolchain format... func_convert_file_noop
# checking for /usr/bin/ld option to reload object files... -r
# checking for x86_64-unknown-linux-objdump... no
# checking for objdump... objdump
# checking how to recognize dependent libraries... pass_all
# checking for x86_64-unknown-linux-dlltool... no
# checking for dlltool... no
# checking how to associate runtime and link libraries... printf %s\n
# checking for x86_64-unknown-linux-ar... no
# checking for ar... ar
# checking for archiver @FILE support... @
# checking for x86_64-unknown-linux-strip... strip
# checking for x86_64-unknown-linux-ranlib... no
# checking for ranlib... ranlib
# checking command to parse nm output from gcc object... ok
# checking for sysroot... no
# checking for a working dd... /usr/bin/dd
# checking how to truncate binary pipes... /usr/bin/dd bs=4096 count=1
# checking for x86_64-unknown-linux-mt... no
# checking for mt... no
# checking if : is a manifest tool... no
# checking for dlfcn.h... yes
# checking for objdir... .libs
# checking if gcc supports -fno-rtti -fno-exceptions... no
# checking for gcc option to produce PIC... -fPIC -DPIC
# checking if gcc PIC flag -fPIC -DPIC works... yes
# checking if gcc static flag -static works... yes
# checking if gcc supports -c -o file.o... yes
# checking if gcc supports -c -o file.o... (cached) yes
# checking whether the gcc linker (/usr/bin/ld -m elf_x86_64) supports shared libraries... yes
# checking whether -lc should be explicitly linked in... no
# checking dynamic linker characteristics... GNU/Linux ld.so
# checking how to hardcode library paths into programs... immediate
# checking whether stripping libraries is possible... yes
# checking if libtool supports shared libraries... yes
# checking whether to build shared libraries... yes
# checking whether to build static libraries... no
# checking for cppunit-config... no
# checking for Cppunit - version >= 1.10.2... no
# checking for x86_64-unknown-linux-g++... no
# checking for x86_64-unknown-linux-c++... no
# checking for x86_64-unknown-linux-gpp... no
# checking for x86_64-unknown-linux-aCC... no
# checking for x86_64-unknown-linux-CC... no
# checking for x86_64-unknown-linux-cxx... no
# checking for x86_64-unknown-linux-cc++... no
# checking for x86_64-unknown-linux-cl.exe... no
# checking for x86_64-unknown-linux-FCC... no
# checking for x86_64-unknown-linux-KCC... no
# checking for x86_64-unknown-linux-RCC... no
# checking for x86_64-unknown-linux-xlC_r... no
# checking for x86_64-unknown-linux-xlC... no
# checking for g++... g++
# checking whether we are using the GNU C++ compiler... yes
# checking whether g++ accepts -g... yes
# checking dependency style of g++... gcc3
# checking how to run the C++ preprocessor... g++ -E
# checking for ld used by g++... /usr/bin/ld -m elf_x86_64
# checking if the linker (/usr/bin/ld -m elf_x86_64) is GNU ld... yes
# checking whether the g++ linker (/usr/bin/ld -m elf_x86_64) supports shared libraries... yes
# checking for g++ option to produce PIC... -fPIC -DPIC
# checking if g++ PIC flag -fPIC -DPIC works... yes
# checking if g++ static flag -static works... yes
# checking if g++ supports -c -o file.o... yes
# checking if g++ supports -c -o file.o... (cached) yes
# checking whether the g++ linker (/usr/bin/ld -m elf_x86_64) supports shared libraries... yes
# checking dynamic linker characteristics... (cached) GNU/Linux ld.so
# checking how to hardcode library paths into programs... immediate
# checking for x86_64-unknown-linux-gcc... gcc
# checking whether we are using the GNU C compiler... (cached) yes
# checking whether gcc accepts -g... (cached) yes
# checking for gcc option to accept ISO C89... (cached) none needed
# checking whether gcc understands -c and -o together... (cached) yes
# checking dependency style of gcc... (cached) gcc3
# checking for bison... bison -y
# checking dependency style of gcc... gcc3
# checking for x86_64-unknown-linux-ar... ar
# checking for sphinx-build... no
# checking for rst2html.py... no
# checking for rst2html... no
# checking for x86_64-unknown-linux-pkg-config... no
# checking for pkg-config... /usr/bin/pkg-config
# checking pkg-config is at least version 0.20... yes
# checking whether g++ supports C++11 features by default... yes
# checking whether the c++ compiler supports nullptr... checking whether the C++ compiler supports `override` keyword... yes
# checking for ZLIB... yes
# checking whether gzbuffer is declared... yes
# checking for gzbuffer... yes
# checking for gzsetparams... yes
# checking for xml2-config... /usr/bin/xml2-config
# checking for libxml - version >= 2.6.24... yes (version 2.9.4)
# checking for SQLITE3... yes
# checking for sqlite3_open_v2... yes
# checking whether to enable Mac OS X native SSL/TLS... no
# checking for main in -lcrypt32... no
# checking for main in -lsecur32... no
# checking for main in -ladvapi32... no
# checking for wincrypt.h... no
# checking for security.h... no
# checking for LIBGNUTLS... yes
# checking for gnutls_certificate_set_x509_system_trust... yes
# checking for nettle_sha1_init in -lnettle... yes
# checking for __gmpz_init in -lgmp... yes
# checking for __gmpz_powm_sec... yes
# checking for LIBSSH2... yes
# checking for LIBCARES... yes
# checking for ares_addr_node... yes
# checking for ares_set_servers... yes
# checking for size_t... yes
# checking for working alloca.h... yes
# checking for alloca... yes
# checking for ANSI C header files... (cached) yes
# checking argz.h usability... yes
# checking argz.h presence... yes
# checking for argz.h... yes
# checking arpa/inet.h usability... yes
# checking arpa/inet.h presence... yes
# checking for arpa/inet.h... yes
# checking fcntl.h usability... yes
# checking fcntl.h presence... yes
# checking for fcntl.h... yes
# checking float.h usability... yes
# checking float.h presence... yes
# checking for float.h... yes
# checking for inttypes.h... (cached) yes
# checking langinfo.h usability... yes
# checking langinfo.h presence... yes
# checking for langinfo.h... yes
# checking libintl.h usability... yes
# checking libintl.h presence... yes
# checking for libintl.h... yes
# checking limits.h usability... yes
# checking limits.h presence... yes
# checking for limits.h... yes
# checking locale.h usability... yes
# checking locale.h presence... yes
# checking for locale.h... yes
# checking malloc.h usability... yes
# checking malloc.h presence... yes
# checking for malloc.h... yes
# checking netdb.h usability... yes
# checking netdb.h presence... yes
# checking for netdb.h... yes
# checking netinet/in.h usability... yes
# checking netinet/in.h presence... yes
# checking for netinet/in.h... yes
# checking netinet/tcp.h usability... yes
# checking netinet/tcp.h presence... yes
# checking for netinet/tcp.h... yes
# checking poll.h usability... yes
# checking poll.h presence... yes
# checking for poll.h... yes
# checking port.h usability... no
# checking port.h presence... no
# checking for port.h... no
# checking signal.h usability... yes
# checking signal.h presence... yes
# checking for signal.h... yes
# checking stddef.h usability... yes
# checking stddef.h presence... yes
# checking for stddef.h... yes
# checking for stdint.h... (cached) yes
# checking stdio_ext.h usability... yes
# checking stdio_ext.h presence... yes
# checking for stdio_ext.h... yes
# checking for stdlib.h... (cached) yes
# checking for string.h... (cached) yes
# checking for strings.h... (cached) yes
# checking sys/ioctl.h usability... yes
# checking sys/ioctl.h presence... yes
# checking for sys/ioctl.h... yes
# checking sys/param.h usability... yes
# checking sys/param.h presence... yes
# checking for sys/param.h... yes
# checking sys/resource.h usability... yes
# checking sys/resource.h presence... yes
# checking for sys/resource.h... yes
# checking sys/signal.h usability... yes
# checking sys/signal.h presence... yes
# checking for sys/signal.h... yes
# checking sys/socket.h usability... yes
# checking sys/socket.h presence... yes
# checking for sys/socket.h... yes
# checking sys/time.h usability... yes
# checking sys/time.h presence... yes
# checking for sys/time.h... yes
# checking for sys/types.h... (cached) yes
# checking sys/uio.h usability... yes
# checking sys/uio.h presence... yes
# checking for sys/uio.h... yes
# checking sys/utsname.h usability... yes
# checking sys/utsname.h presence... yes
# checking for sys/utsname.h... yes
# checking termios.h usability... yes
# checking termios.h presence... yes
# checking for termios.h... yes
# checking for unistd.h... (cached) yes
# checking utime.h usability... yes
# checking utime.h presence... yes
# checking for utime.h... yes
# checking wchar.h usability... yes
# checking wchar.h presence... yes
# checking for wchar.h... yes
# checking ifaddrs.h usability... yes
# checking ifaddrs.h presence... yes
# checking for ifaddrs.h... yes
# checking pwd.h usability... yes
# checking pwd.h presence... yes
# checking for pwd.h... yes
# checking for stdbool.h that conforms to C99... no
# checking for _Bool... no
# checking for an ANSI C-conforming const... yes
# checking for inline... inline
# checking for int16_t... yes
# checking for int32_t... yes
# checking for int64_t... yes
# checking for int8_t... yes
# checking for mode_t... yes
# checking for off_t... yes
# checking for size_t... (cached) yes
# checking for ssize_t... yes
# checking whether time.h and sys/time.h may both be included... yes
# checking whether struct tm is in sys/time.h or time.h... time.h
# checking for uint16_t... yes
# checking for uint32_t... yes
# checking for uint64_t... yes
# checking for uint8_t... yes
# checking for pid_t... yes
# checking for working volatile... yes
# checking for ptrdiff_t... yes
# checking for struct timespec... yes
# checking whether byte ordering is bigendian... no
# checking for special C compiler options needed for large files... no
# checking for _FILE_OFFSET_BITS value needed for large files... no
# checking whether NLS is requested... yes
# checking for msgfmt... /usr/bin/msgfmt
# checking for gmsgfmt... /usr/bin/msgfmt
# checking for xgettext... /usr/bin/xgettext
# checking for msgmerge... /usr/bin/msgmerge
# checking for ld used by GCC... /usr/bin/ld -m elf_x86_64
# checking if the linker (/usr/bin/ld -m elf_x86_64) is GNU ld... yes
# checking for shared library run path origin... done
# checking for CFPreferencesCopyAppValue... no
# checking for CFLocaleCopyCurrent... no
# checking for GNU gettext in libc... yes
# checking whether to use NLS... yes
# checking where the gettext function comes from... libc
# checking for error_at_line... yes
# checking whether gcc needs -traditional... no
# checking for working memcmp... yes
# checking for sys/time.h... (cached) yes
# checking for unistd.h... (cached) yes
# checking for alarm... yes
# checking for working mktime... yes
# checking sys/select.h usability... yes
# checking sys/select.h presence... yes
# checking for sys/select.h... yes
# checking for sys/socket.h... (cached) yes
# checking types of arguments for select... int,fd_set *,struct timeval *
# checking whether lstat correctly handles trailing slash... yes
# checking whether stat accepts an empty string... no
# checking for strftime... yes
# checking for vprintf... yes
# checking for _doprnt... no
# checking vfork.h usability... no
# checking vfork.h presence... no
# checking for vfork.h... no
# checking for fork... yes
# checking for vfork... yes
# checking for working fork... yes
# checking for working vfork... (cached) yes
# checking for working strtod... yes
# checking for __argz_count... yes
# checking for __argz_next... yes
# checking for __argz_stringify... yes
# checking for atexit... yes
# checking for ftruncate... yes
# checking for getcwd... yes
# checking for gethostbyaddr... yes
# checking for gethostbyname... yes
# checking for getifaddrs... yes
# checking for getpagesize... yes
# checking for getrandom... no
# checking for memchr... yes
# checking for memmove... yes
# checking for mempcpy... yes
# checking for memset... yes
# checking for mkdir... yes
# checking for mmap... yes
# checking for munmap... yes
# checking for nl_langinfo... yes
# checking for posix_fadvise... yes
# checking for posix_memalign... yes
# checking for pow... yes
# checking for putenv... yes
# checking for rmdir... yes
# checking for select... yes
# checking for setlocale... yes
# checking for sigaction... yes
# checking for sleep... yes
# checking for socket... yes
# checking for stpcpy... yes
# checking for strcasecmp... yes
# checking for strchr... yes
# checking for strcspn... yes
# checking for strdup... yes
# checking for strerror... yes
# checking for strncasecmp... yes
# checking for strstr... yes
# checking for strtol... yes
# checking for strtoul... yes
# checking for strtoull... yes
# checking for tzset... yes
# checking for unsetenv... yes
# checking for usleep... yes
# checking for utime... yes
# checking for utimes... yes
# checking for getrandom linux syscall interface... yes
# checking for epoll_create... yes
# checking for posix_fallocate... yes
# checking for fallocate... yes
# checking for asctime_r... yes
# checking for localtime_r... yes
# checking for basename... yes
# checking for gai_strerror... yes
# checking for getaddrinfo... yes
# checking for gettimeofday... yes
# checking for strptime... yes
# checking for timegm... yes
# checking for daemon... yes
# checking for poll... yes
# checking for port_associate... no
# checking for kqueue... no
# checking for struct sockaddr_in.sin_len... no
# checking for struct sockaddr_in6.sin6_len... no
# checking whether struct option.name is assignable from const char*... yes
# checking that generated files are newer than configure... done
# configure: creating ./config.status
# config.status: creating Makefile
# config.status: creating src/Makefile
# config.status: creating src/libaria2.pc
# config.status: creating src/includes/Makefile
# config.status: creating test/Makefile
# config.status: creating po/Makefile.in
# config.status: creating lib/Makefile
# config.status: creating doc/Makefile
# config.status: creating doc/manual-src/Makefile
# config.status: creating doc/manual-src/en/Makefile
# config.status: creating doc/manual-src/en/conf.py
# config.status: creating doc/manual-src/ru/Makefile
# config.status: creating doc/manual-src/ru/conf.py
# config.status: creating doc/manual-src/pt/Makefile
# config.status: creating doc/manual-src/pt/conf.py
# config.status: creating deps/Makefile
# config.status: creating config.h
# config.status: executing depfiles commands
# config.status: executing libtool commands
# config.status: executing po-directories commands
# config.status: creating po/POTFILES
# config.status: creating po/Makefile
# === configuring in deps/wslay (/tmp/aria2/src/aria2-1.24.0/deps/wslay)
# configure: running /bin/sh ./configure --disable-option-checking '--prefix=/usr' '--host=x86_64-unknown-linux' '--with-ca-bundle=/etc/ssl/certs/ca-certificates.crt' 'host_alias=x86_64-unknown-linux' 'CFLAGS=' 'LDFLAGS=' 'CPPFLAGS=' 'CXXFLAGS=' --cache-file=/dev/null --srcdir=.
# checking build system type... x86_64-pc-linux-gnu
# checking host system type... x86_64-unknown-linux-gnu
# checking how to print strings... printf
# checking for x86_64-unknown-linux-gcc... no
# checking for gcc... gcc
# checking whether the C compiler works... yes
# checking for C compiler default output file name... a.out
# checking for suffix of executables...
# checking whether we are cross compiling... no
# checking for suffix of object files... o
# checking whether we are using the GNU C compiler... yes
# checking whether gcc accepts -g... yes
# checking for gcc option to accept ISO C89... none needed
# checking whether gcc understands -c and -o together... yes
# checking for a sed that does not truncate output... /usr/bin/sed
# checking for grep that handles long lines and -e... /usr/bin/grep
# checking for egrep... /usr/bin/grep -E
# checking for fgrep... /usr/bin/grep -F
# checking for ld used by gcc... /usr/bin/ld
# checking if the linker (/usr/bin/ld) is GNU ld... yes
# checking for BSD- or MS-compatible name lister (nm)... no
# checking for x86_64-unknown-linux-dumpbin... no
# checking for x86_64-unknown-linux-link... no
# checking for dumpbin... no
# checking for link... link -dump
# checking the name lister (nm) interface... BSD nm
# checking whether ln -s works... yes
# checking the maximum length of command line arguments... 1572864
# checking how to convert x86_64-pc-linux-gnu file names to x86_64-unknown-linux-gnu format... func_convert_file_noop
# checking how to convert x86_64-pc-linux-gnu file names to toolchain format... func_convert_file_noop
# checking for /usr/bin/ld option to reload object files... -r
# checking for x86_64-unknown-linux-objdump... no
# checking for objdump... objdump
# checking how to recognize dependent libraries... pass_all
# checking for x86_64-unknown-linux-dlltool... no
# checking for dlltool... no
# checking how to associate runtime and link libraries... printf %s\n
# checking for x86_64-unknown-linux-ar... no
# checking for ar... ar
# checking for archiver @FILE support... @
# checking for x86_64-unknown-linux-strip... no
# checking for strip... strip
# checking for x86_64-unknown-linux-ranlib... no
# checking for ranlib... ranlib
# checking for gawk... gawk
# checking command to parse nm output from gcc object... ok
# checking for sysroot... no
# checking for a working dd... /usr/bin/dd
# checking how to truncate binary pipes... /usr/bin/dd bs=4096 count=1
# checking for x86_64-unknown-linux-mt... no
# checking for mt... no
# checking if : is a manifest tool... no
# checking how to run the C preprocessor... gcc -E
# checking for ANSI C header files... yes
# checking for sys/types.h... yes
# checking for sys/stat.h... yes
# checking for stdlib.h... yes
# checking for string.h... yes
# checking for memory.h... yes
# checking for strings.h... yes
# checking for inttypes.h... yes
# checking for stdint.h... yes
# checking for unistd.h... yes
# checking for dlfcn.h... yes
# checking for objdir... .libs
# checking if gcc supports -fno-rtti -fno-exceptions... no
# checking for gcc option to produce PIC... -fPIC -DPIC
# checking if gcc PIC flag -fPIC -DPIC works... yes
# checking if gcc static flag -static works... yes
# checking if gcc supports -c -o file.o... yes
# checking if gcc supports -c -o file.o... (cached) yes
# checking whether the gcc linker (/usr/bin/ld -m elf_x86_64) supports shared libraries... yes
# checking whether -lc should be explicitly linked in... no
# checking dynamic linker characteristics... GNU/Linux ld.so
# checking how to hardcode library paths into programs... immediate
# checking whether stripping libraries is possible... yes
# checking if libtool supports shared libraries... yes
# checking whether to build shared libraries... yes
# checking whether to build static libraries... yes
# checking target system type... x86_64-unknown-linux-gnu
# checking for a BSD-compatible install... /usr/bin/install -c
# checking whether build environment is sane... yes
# checking for a thread-safe mkdir -p... /usr/bin/mkdir -p
# checking whether make sets $(MAKE)... yes
# checking for style of include used by make... GNU
# checking whether make supports nested variables... yes
# checking dependency style of gcc... gcc3
# checking for x86_64-unknown-linux-gcc... gcc
# checking whether we are using the GNU C compiler... (cached) yes
# checking whether gcc accepts -g... (cached) yes
# checking for gcc option to accept ISO C89... (cached) none needed
# checking whether gcc understands -c and -o together... (cached) yes
# checking for x86_64-unknown-linux-g++... no
# checking for x86_64-unknown-linux-c++... no
# checking for x86_64-unknown-linux-gpp... no
# checking for x86_64-unknown-linux-aCC... no
# checking for x86_64-unknown-linux-CC... no
# checking for x86_64-unknown-linux-cxx... no
# checking for x86_64-unknown-linux-cc++... no
# checking for x86_64-unknown-linux-cl.exe... no
# checking for x86_64-unknown-linux-FCC... no
# checking for x86_64-unknown-linux-KCC... no
# checking for x86_64-unknown-linux-RCC... no
# checking for x86_64-unknown-linux-xlC_r... no
# checking for x86_64-unknown-linux-xlC... no
# checking for g++... g++
# checking whether we are using the GNU C++ compiler... yes
# checking whether g++ accepts -g... yes
# checking how to run the C++ preprocessor... g++ -E
# checking for ld used by g++... /usr/bin/ld -m elf_x86_64
# checking if the linker (/usr/bin/ld -m elf_x86_64) is GNU ld... yes
# checking whether the g++ linker (/usr/bin/ld -m elf_x86_64) supports shared libraries... yes
# checking for g++ option to produce PIC... -fPIC -DPIC
# checking if g++ PIC flag -fPIC -DPIC works... yes
# checking if g++ static flag -static works... yes
# checking if g++ supports -c -o file.o... yes
# checking if g++ supports -c -o file.o... (cached) yes
# checking whether the g++ linker (/usr/bin/ld -m elf_x86_64) supports shared libraries... yes
# checking dynamic linker characteristics... (cached) GNU/Linux ld.so
# checking how to hardcode library paths into programs... immediate
# checking dependency style of g++... gcc3
# checking whether ln -s works... yes
# checking whether make sets $(MAKE)... (cached) yes
# checking for x86_64-unknown-linux-pkg-config... no
# checking for pkg-config... /usr/bin/pkg-config
# checking pkg-config is at least version 0.20... yes
# checking for sphinx-build... no
# checking for NETTLE... yes
# checking for CU_initialize_registry in -lcunit... no
# checking arpa/inet.h usability... yes
# checking arpa/inet.h presence... yes
# checking for arpa/inet.h... yes
# checking netinet/in.h usability... yes
# checking netinet/in.h presence... yes
# checking for netinet/in.h... yes
# checking stddef.h usability... yes
# checking stddef.h presence... yes
# checking for stddef.h... yes
# checking for stdint.h... (cached) yes
# checking for stdlib.h... (cached) yes
# checking for string.h... (cached) yes
# checking for unistd.h... (cached) yes
# checking for size_t... yes
# checking for ssize_t... yes
# checking for uint8_t... yes
# checking for uint16_t... yes
# checking for uint32_t... yes
# checking for uint64_t... yes
# checking for ptrdiff_t... yes
# checking whether byte ordering is bigendian... no
# checking for memmove... yes
# checking for memset... yes
# checking for ntohl... yes
# checking for ntohs... yes
# checking for htons... yes
# checking that generated files are newer than configure... done
# configure: creating ./config.status
# config.status: creating Makefile
# config.status: creating lib/Makefile
# config.status: creating lib/libwslay.pc
# config.status: creating lib/includes/Makefile
# config.status: creating lib/includes/wslay/wslayver.h
# config.status: creating tests/Makefile
# config.status: creating config.h
# config.status: executing libtool commands
# config.status: executing depfiles commands
# configure: summary of build options:
#
# version: 1.0.1-DEV shared 0:1:0
# Host type: x86_64-unknown-linux-gnu
# Install prefix: /usr
# C compiler: gcc
# CFlags:
# Library types: Shared=yes, Static=yes
# CUnit: no
# Nettle: yes
# Build examples: yes
#
# configure: summary of build options:
#
# Build: x86_64-pc-linux-gnu
# Host: x86_64-unknown-linux-gnu
# Target: x86_64-unknown-linux-gnu
# Install prefix: /usr
# CC: gcc
# CXX: g++
# CPP: gcc -E
# CXXFLAGS:
# CFLAGS:
# CPPFLAGS:
# LDFLAGS:
# LIBS:
# DEFS: -DHAVE_CONFIG_H
# CXX1XCXXFLAGS:
# EXTRACXXFLAGS: -pipe
# EXTRACFLAGS: -pipe
# EXTRACPPFLAGS:
# EXTRALDFLAGS:
# EXTRALIBS:
# WARNCXXFLAGS:
# LibUV: no (CFLAGS='' LIBS='')
# SQLite3: yes (CFLAGS='' LIBS='-lsqlite3')
# SSL Support: yes
# AppleTLS: no (LDFLAGS='')
# WinTLS: no (LIBS='')
# GnuTLS: yes (CFLAGS='-I/usr/include/p11-kit-1' LIBS='-lgnutls')
# OpenSSL: no (CFLAGS='' LIBS='')
# CA Bundle: /etc/ssl/certs/ca-certificates.crt
# LibNettle: yes (CFLAGS='' LIBS='-lnettle')
# LibGmp: yes (CFLAGS='' LIBS='-lgmp')
# LibGcrypt: no (CFLAGS='' LIBS='')
# LibXML2: yes (CFLAGS='-I/usr/include/libxml2' LIBS='-lxml2 -lz -llzma -lm -ldl')
# LibExpat: no (CFLAGS='' LIBS='')
# LibCares: yes (CFLAGS='' LIBS='-lcares')
# Zlib: yes (CFLAGS='' LIBS='-lz')
# Libssh2: yes (CFLAGS='' LIBS='-lssh2')
# Tcmalloc: no (CFLAGS='' LIBS='')
# Jemalloc: no (CFLAGS='' LIBS='')
# Epoll: yes
# Bittorrent: yes
# Metalink: yes
# XML-RPC: yes
# Message Digest: libnettle
# WebSocket: yes (CFLAGS='-I$(top_builddir)/deps/wslay/lib/includes -I$(top_srcdir)/deps/wslay/lib/includes' LIBS='$(top_builddir)/deps/wslay/lib/libwslay.la')
# Libaria2: no (shared=yes static=no)
# bash_completion dir: ${datarootdir}/doc/${PACKAGE_TARNAME}/bash_completion
# Static build: no
#
# make all-recursive
# make[1]: Entering directory '/tmp/aria2/src/aria2-1.24.0'
# Making all in po
# make[2]: Entering directory '/tmp/aria2/src/aria2-1.24.0/po'
# make[2]: Leaving directory '/tmp/aria2/src/aria2-1.24.0/po'
# Making all in lib
# make[2]: Entering directory '/tmp/aria2/src/aria2-1.24.0/lib'
# make[2]: Nothing to be done for 'all'.
# make[2]: Leaving directory '/tmp/aria2/src/aria2-1.24.0/lib'
# Making all in deps
# make[2]: Entering directory '/tmp/aria2/src/aria2-1.24.0/deps'
# Making all in wslay
# make[3]: Entering directory '/tmp/aria2/src/aria2-1.24.0/deps/wslay'
# make all-recursive
# make[4]: Entering directory '/tmp/aria2/src/aria2-1.24.0/deps/wslay'
# Making all in lib
# make[5]: Entering directory '/tmp/aria2/src/aria2-1.24.0/deps/wslay/lib'
# Making all in includes
# make[6]: Entering directory '/tmp/aria2/src/aria2-1.24.0/deps/wslay/lib/includes'
# make[6]: Nothing to be done for 'all'.
# make[6]: Leaving directory '/tmp/aria2/src/aria2-1.24.0/deps/wslay/lib/includes'
# make[6]: Entering directory '/tmp/aria2/src/aria2-1.24.0/deps/wslay/lib'
# /bin/sh ../libtool --tag=CC --mode=compile gcc -DHAVE_CONFIG_H -I. -I.. -DHAVE_CONFIG_H -I./includes -I./includes -Wall -MT wslay_frame.lo -MD -MP -MF .deps/wslay_frame.Tpo -c -o wslay_frame.lo wslay_frame.c
# /bin/sh ../libtool --tag=CC --mode=compile gcc -DHAVE_CONFIG_H -I. -I.. -DHAVE_CONFIG_H -I./includes -I./includes -Wall -MT wslay_event.lo -MD -MP -MF .deps/wslay_event.Tpo -c -o wslay_event.lo wslay_event.c
# libtool: compile: gcc -DHAVE_CONFIG_H -I. -I.. -DHAVE_CONFIG_H -I./includes -I./includes -Wall -MT wslay_frame.lo -MD -MP -MF .deps/wslay_frame.Tpo -c wslay_frame.c -fPIC -DPIC -o .libs/wslay_frame.o
# libtool: compile: gcc -DHAVE_CONFIG_H -I. -I.. -DHAVE_CONFIG_H -I./includes -I./includes -Wall -MT wslay_event.lo -MD -MP -MF .deps/wslay_event.Tpo -c wslay_event.c -fPIC -DPIC -o .libs/wslay_event.o
# libtool: compile: gcc -DHAVE_CONFIG_H -I. -I.. -DHAVE_CONFIG_H -I./includes -I./includes -Wall -MT wslay_frame.lo -MD -MP -MF .deps/wslay_frame.Tpo -c wslay_frame.c -o wslay_frame.o >/dev/null 2>&1
# libtool: compile: gcc -DHAVE_CONFIG_H -I. -I.. -DHAVE_CONFIG_H -I./includes -I./includes -Wall -MT wslay_event.lo -MD -MP -MF .deps/wslay_event.Tpo -c wslay_event.c -o wslay_event.o >/dev/null 2>&1
# mv -f .deps/wslay_frame.Tpo .deps/wslay_frame.Plo
# /bin/sh ../libtool --tag=CC --mode=compile gcc -DHAVE_CONFIG_H -I. -I.. -DHAVE_CONFIG_H -I./includes -I./includes -Wall -MT wslay_queue.lo -MD -MP -MF .deps/wslay_queue.Tpo -c -o wslay_queue.lo wslay_queue.c
# libtool: compile: gcc -DHAVE_CONFIG_H -I. -I.. -DHAVE_CONFIG_H -I./includes -I./includes -Wall -MT wslay_queue.lo -MD -MP -MF .deps/wslay_queue.Tpo -c wslay_queue.c -fPIC -DPIC -o .libs/wslay_queue.o
# mv -f .deps/wslay_event.Tpo .deps/wslay_event.Plo
# /bin/sh ../libtool --tag=CC --mode=compile gcc -DHAVE_CONFIG_H -I. -I.. -DHAVE_CONFIG_H -I./includes -I./includes -Wall -MT wslay_net.lo -MD -MP -MF .deps/wslay_net.Tpo -c -o wslay_net.lo wslay_net.c
# libtool: compile: gcc -DHAVE_CONFIG_H -I. -I.. -DHAVE_CONFIG_H -I./includes -I./includes -Wall -MT wslay_queue.lo -MD -MP -MF .deps/wslay_queue.Tpo -c wslay_queue.c -o wslay_queue.o >/dev/null 2>&1
# mv -f .deps/wslay_queue.Tpo .deps/wslay_queue.Plo
# libtool: compile: gcc -DHAVE_CONFIG_H -I. -I.. -DHAVE_CONFIG_H -I./includes -I./includes -Wall -MT wslay_net.lo -MD -MP -MF .deps/wslay_net.Tpo -c wslay_net.c -fPIC -DPIC -o .libs/wslay_net.o
# libtool: compile: gcc -DHAVE_CONFIG_H -I. -I.. -DHAVE_CONFIG_H -I./includes -I./includes -Wall -MT wslay_net.lo -MD -MP -MF .deps/wslay_net.Tpo -c wslay_net.c -o wslay_net.o >/dev/null 2>&1
# mv -f .deps/wslay_net.Tpo .deps/wslay_net.Plo
# /bin/sh ../libtool --tag=CC --mode=link gcc -Wall -no-undefined -version-info 0:1:0 -o libwslay.la wslay_frame.lo wslay_event.lo wslay_queue.lo wslay_net.lo
# libtool: warning: '-version-info/-version-number' is ignored for convenience libraries
# libtool: link: ar cru .libs/libwslay.a .libs/wslay_frame.o .libs/wslay_event.o .libs/wslay_queue.o .libs/wslay_net.o
# ar: `u' modifier ignored since `D' is the default (see `U')
# libtool: link: ranlib .libs/libwslay.a
# libtool: link: ( cd ".libs" && rm -f "libwslay.la" && ln -s "../libwslay.la" "libwslay.la" )
# make[6]: Leaving directory '/tmp/aria2/src/aria2-1.24.0/deps/wslay/lib'
# make[5]: Leaving directory '/tmp/aria2/src/aria2-1.24.0/deps/wslay/lib'
# Making all in tests
# make[5]: Entering directory '/tmp/aria2/src/aria2-1.24.0/deps/wslay/tests'
# make[5]: Nothing to be done for 'all'.
# make[5]: Leaving directory '/tmp/aria2/src/aria2-1.24.0/deps/wslay/tests'
# make[5]: Entering directory '/tmp/aria2/src/aria2-1.24.0/deps/wslay'
# make[5]: Leaving directory '/tmp/aria2/src/aria2-1.24.0/deps/wslay'
# make[4]: Leaving directory '/tmp/aria2/src/aria2-1.24.0/deps/wslay'
# make[3]: Leaving directory '/tmp/aria2/src/aria2-1.24.0/deps/wslay'
# make[3]: Entering directory '/tmp/aria2/src/aria2-1.24.0/deps'
# make[3]: Nothing to be done for 'all-am'.
# make[3]: Leaving directory '/tmp/aria2/src/aria2-1.24.0/deps'
# make[2]: Leaving directory '/tmp/aria2/src/aria2-1.24.0/deps'
# Making all in src
# make[2]: Entering directory '/tmp/aria2/src/aria2-1.24.0/src'
# Making all in includes
# make[3]: Entering directory '/tmp/aria2/src/aria2-1.24.0/src/includes'
# make[3]: Nothing to be done for 'all'.
# make[3]: Leaving directory '/tmp/aria2/src/aria2-1.24.0/src/includes'
# make[3]: Entering directory '/tmp/aria2/src/aria2-1.24.0/src'
# CXX A2STR.lo
# CXX AbstractAuthResolver.lo
# CXX AbstractCommand.lo
# CXX AbstractDiskWriter.lo
# CXX AbstractHttpServerResponseCommand.lo
# CXX AbstractOptionHandler.lo
# CXX AbstractProxyRequestCommand.lo
# CXX AbstractProxyResponseCommand.lo
# CXX AbstractSingleDiskAdaptor.lo
# CXX AdaptiveFileAllocationIterator.lo
# CXX AdaptiveURISelector.lo
# CXX AuthConfig.lo
# CXX AuthConfigFactory.lo
# CXX AutoSaveCommand.lo
# CXX BackupIPv4ConnectCommand.lo
# CXX base32.lo
# CXX bitfield.lo
# CXX BitfieldMan.lo
# CXX BufferedFile.lo
# CXX ByteArrayDiskWriter.lo
# CXX CheckIntegrityCommand.lo
# CXX CheckIntegrityDispatcherCommand.lo
# CXX CheckIntegrityEntry.lo
# CXX Checksum.lo
# CXX ChecksumCheckIntegrityEntry.lo
# CXX ChunkChecksum.lo
# CXX ChunkedDecodingStreamFilter.lo
# CXX ColorizedStream.lo
# CXX Command.lo
# CXX ConnectCommand.lo
# CXX console.lo
# CXX ConsoleStatCalc.lo
# CXX ContentTypeRequestGroupCriteria.lo
# CXX Context.lo
# CXX ContextAttribute.lo
# CXX Cookie.lo
# CXX CookieStorage.lo
# CXX cookie_helper.lo
# CXX CreateRequestCommand.lo
# CXX CUIDCounter.lo
# CXX DefaultAuthResolver.lo
# CXX DefaultBtProgressInfoFile.lo
# CXX DefaultDiskWriter.lo
# CXX DefaultDiskWriterFactory.lo
# CXX DefaultPieceStorage.lo
# CXX DefaultStreamPieceSelector.lo
# CXX DirectDiskAdaptor.lo
# CXX DiskAdaptor.lo
# CXX DlAbortEx.lo
# CXX DlRetryEx.lo
# CXX DNSCache.lo
# CXX DownloadCommand.lo
# CXX DownloadContext.lo
# CXX DownloadEngine.lo
# CXX DownloadEngineFactory.lo
# CXX DownloadFailureException.lo
# CXX DownloadHandler.lo
# CXX DownloadHandlerConstants.lo
# CXX DownloadResult.lo
# CXX download_handlers.lo
# CXX download_helper.lo
# CXX Exception.lo
# CXX FatalException.lo
# CXX FeatureConfig.lo
# CXX FeedbackURISelector.lo
# CXX File.lo
# CXX FileAllocationCommand.lo
# CXX FileAllocationDispatcherCommand.lo
# CXX FileAllocationEntry.lo
# CXX FileEntry.lo
# CXX FillRequestGroupCommand.lo
# CXX fmt.lo
# CXX FtpConnection.lo
# CXX FtpDownloadCommand.lo
# CXX FtpFinishDownloadCommand.lo
# CXX FtpInitiateConnectionCommand.lo
# CXX FtpNegotiationCommand.lo
# CXX FtpTunnelRequestCommand.lo
# CXX FtpTunnelResponseCommand.lo
# CXX GeomStreamPieceSelector.lo
# CXX GroupId.lo
# CXX GrowSegment.lo
# CXX HaveEraseCommand.lo
# CXX help_tags.lo
# CXX HttpConnection.lo
# CXX HttpDownloadCommand.lo
# CXX HttpHeader.lo
# CXX HttpHeaderProcessor.lo
# CXX HttpInitiateConnectionCommand.lo
# CXX HttpListenCommand.lo
# CXX HttpProxyRequestCommand.lo
# CXX HttpProxyResponseCommand.lo
# CXX HttpRequest.lo
# CXX HttpRequestCommand.lo
# CXX HttpResponse.lo
# CXX HttpResponseCommand.lo
# CXX HttpServer.lo
# CXX HttpServerBodyCommand.lo
# CXX HttpServerCommand.lo
# CXX HttpServerResponseCommand.lo
# CXX HttpSkipResponseCommand.lo
# CXX InitiateConnectionCommand.lo
# CXX InitiateConnectionCommandFactory.lo
# CXX InorderStreamPieceSelector.lo
# CXX RandomStreamPieceSelector.lo
# CXX InorderURISelector.lo
# CXX IOFile.lo
# CXX IteratableChecksumValidator.lo
# CXX IteratableChunkChecksumValidator.lo
# CXX json.lo
# CXX JsonParser.lo
# CXX LogFactory.lo
# CXX Logger.lo
# CXX LongestSequencePieceSelector.lo
# CXX MessageDigest.lo
# CXX message_digest_helper.lo
# CXX MetadataInfo.lo
# CXX MetalinkHttpEntry.lo
# CXX MultiDiskAdaptor.lo
# CXX MultiFileAllocationIterator.lo
# CXX MultiUrlRequestInfo.lo
# CXX NameResolver.lo
# CXX Netrc.lo
# CXX NetrcAuthResolver.lo
# CXX NetStat.lo
# CXX Notifier.lo
# CXX NsCookieParser.lo
# CXX NullSinkStreamFilter.lo
# CXX Option.lo
# CXX OptionHandler.lo
# CXX OptionHandlerException.lo
# CXX OptionHandlerFactory.lo
# CXX OptionHandlerImpl.lo
# CXX OptionParser.lo
# CXX option_processing.lo
# CXX paramed_string.lo
# CXX PeerStat.lo
# CXX Piece.lo
# CXX PiecedSegment.lo
# CXX PieceHashCheckIntegrityEntry.lo
# CXX PieceStatMan.lo
# CXX Platform.lo
# CXX prefs.lo
# CXX ProtocolDetector.lo
# CXX Range.lo
# CXX RarestPieceSelector.lo
# CXX RealtimeCommand.lo
# CXX RecoverableException.lo
# CXX Request.lo
# CXX RequestGroup.lo
# CXX RequestGroupEntry.lo
# CXX RequestGroupMan.lo
# CXX RpcMethod.lo
# CXX RpcMethodFactory.lo
# CXX RpcMethodImpl.lo
# CXX RpcRequest.lo
# CXX RpcResponse.lo
# CXX rpc_helper.lo
# CXX SaveSessionCommand.lo
# CXX SegmentMan.lo
# CXX SelectEventPoll.lo
# CXX ServerStat.lo
# CXX ServerStatMan.lo
# CXX SessionSerializer.lo
# CXX Signature.lo
# CXX SimpleRandomizer.lo
# CXX SingleFileAllocationIterator.lo
# CXX SinkStreamFilter.lo
# CXX SocketBuffer.lo
# CXX SocketCore.lo
# CXX SocketRecvBuffer.lo
# CXX SpeedCalc.lo
# CXX StreamCheckIntegrityEntry.lo
# CXX StreamFileAllocationEntry.lo
# CXX StreamFilter.lo
# CXX TimeA2.lo
# CXX TimeBasedCommand.lo
# CXX TimedHaltCommand.lo
# CXX TimerA2.lo
# CXX TorrentAttribute.lo
# CXX TransferStat.lo
# CXX TruncFileAllocationIterator.lo
# CXX UnknownLengthPieceStorage.lo
# CXX UnknownOptionException.lo
# CXX uri.lo
# CXX UriListParser.lo
# CXX URIResult.lo
# CC uri_split.lo
# CXX util.lo
# CXX util_security.lo
# CXX ValueBase.lo
# CXX ValueBaseStructParserStateImpl.lo
# CXX ValueBaseStructParserStateMachine.lo
# CXX version_usage.lo
# CXX wallclock.lo
# CXX WatchProcessCommand.lo
# CXX WrDiskCache.lo
# CXX WrDiskCacheEntry.lo
# CXX XmlRpcRequestParserController.lo
# CXX OpenedFileCounter.lo
# CXX SHA1IOFile.lo
# CXX EvictSocketPoolCommand.lo
# CXX WebSocketInteractionCommand.lo
# CXX WebSocketResponseCommand.lo
# CXX WebSocketSession.lo
# CXX WebSocketSessionMan.lo
# CXX XmlAttr.lo
# CXX XmlParser.lo
# CXX Xml2XmlParser.lo
# CXX XmlRpcDiskWriter.lo
# CXX XmlRpcRequestParserStateImpl.lo
# CXX XmlRpcRequestParserStateMachine.lo
# CXX FallocFileAllocationIterator.lo
# CXX EpollEventPoll.lo
# CXX LibgnutlsTLSContext.lo
# CXX LibgnutlsTLSSession.lo
# CXX LibnettleARC4Encryptor.lo
# CXX LibnettleMessageDigestImpl.lo
# CXX a2gmp.lo
# CXX LibgmpDHKeyExchange.lo
# CXX GZipDecodingStreamFilter.lo
# CXX GZipEncoder.lo
# CXX GZipFile.lo
# CXX Adler32MessageDigestImpl.lo
# CXX Sqlite3CookieParser.lo
# CXX Sqlite3CookieParserImpl.lo
# CXX SSHSession.lo
# CXX SftpNegotiationCommand.lo
# CXX SftpDownloadCommand.lo
# CXX SftpFinishDownloadCommand.lo
# CXX AsyncNameResolver.lo
# CXX AsyncNameResolverMan.lo
# CXX AbstractBtMessage.lo
# CXX ActivePeerConnectionCommand.lo
# CXX AnnounceList.lo
# CXX AnnounceTier.lo
# CXX bencode2.lo
# CXX BencodeParser.lo
# CXX bittorrent_helper.lo
# CXX BtAbortOutstandingRequestEvent.lo
# CXX BtAllowedFastMessage.lo
# CXX BtAnnounce.lo
# CXX BtBitfieldMessage.lo
# CXX BtBitfieldMessageValidator.lo
# CXX BtCancelMessage.lo
# CXX BtCheckIntegrityEntry.lo
# CXX BtChokeMessage.lo
# CXX BtDependency.lo
# CXX BtExtendedMessage.lo
# CXX BtFileAllocationEntry.lo
# CXX BtHandshakeMessage.lo
# CXX BtHandshakeMessageValidator.lo
# CXX BtHaveAllMessage.lo
# CXX BtHaveMessage.lo
# CXX BtHaveNoneMessage.lo
# CXX BtInterestedMessage.lo
# CXX BtKeepAliveMessage.lo
# CXX BtLeecherStateChoke.lo
# CXX BtNotInterestedMessage.lo
# CXX BtPieceMessage.lo
# CXX BtPieceMessageValidator.lo
# CXX BtPortMessage.lo
# CXX BtPostDownloadHandler.lo
# CXX BtRegistry.lo
# CXX BtRejectMessage.lo
# CXX BtRequestMessage.lo
# CXX BtRuntime.lo
# CXX BtSeederStateChoke.lo
# CXX BtSetup.lo
# CXX BtStopDownloadCommand.lo
# CXX BtSuggestPieceMessage.lo
# CXX BtUnchokeMessage.lo
# CXX DefaultBtAnnounce.lo
# CXX DefaultBtInteractive.lo
# CXX DefaultBtMessageDispatcher.lo
# CXX DefaultBtMessageFactory.lo
# CXX DefaultBtMessageReceiver.lo
# CXX DefaultBtRequestFactory.lo
# CXX DefaultExtensionMessageFactory.lo
# CXX DefaultPeerStorage.lo
# CXX DHTAbstractMessage.lo
# CXX DHTAbstractTask.lo
# CXX DHTAnnouncePeerMessage.lo
# CXX DHTAnnouncePeerReplyMessage.lo
# CXX DHTAutoSaveCommand.lo
# CXX DHTBucket.lo
# CXX DHTBucketRefreshCommand.lo
# CXX DHTBucketRefreshTask.lo
# CXX DHTBucketTree.lo
# CXX DHTConnectionImpl.lo
# CXX DHTEntryPointNameResolveCommand.lo
# CXX DHTFindNodeMessage.lo
# CXX DHTFindNodeReplyMessage.lo
# CXX DHTGetPeersCommand.lo
# CXX DHTGetPeersMessage.lo
# CXX DHTGetPeersReplyMessage.lo
# CXX DHTInteractionCommand.lo
# CXX DHTMessage.lo
# CXX DHTMessageDispatcherImpl.lo
# CXX DHTMessageEntry.lo
# CXX DHTMessageFactoryImpl.lo
# CXX DHTMessageReceiver.lo
# CXX DHTMessageTracker.lo
# CXX DHTMessageTrackerEntry.lo
# CXX DHTNode.lo
# CXX DHTNodeLookupEntry.lo
# CXX DHTNodeLookupTask.lo
# CXX DHTNodeLookupTaskCallback.lo
# CXX DHTPeerAnnounceCommand.lo
# CXX DHTPeerAnnounceEntry.lo
# CXX DHTPeerAnnounceStorage.lo
# CXX DHTPeerLookupTask.lo
# CXX DHTPeerLookupTaskCallback.lo
# CXX DHTPingMessage.lo
# CXX DHTPingReplyMessage.lo
# CXX DHTPingTask.lo
# CXX DHTQueryMessage.lo
# CXX DHTRegistry.lo
# CXX DHTReplaceNodeTask.lo
# CXX DHTResponseMessage.lo
# CXX DHTRoutingTable.lo
# CXX DHTRoutingTableDeserializer.lo
# CXX DHTRoutingTableSerializer.lo
# CXX DHTSetup.lo
# CXX DHTTaskExecutor.lo
# CXX DHTTaskFactoryImpl.lo
# CXX DHTTaskQueueImpl.lo
# CXX DHTTokenTracker.lo
# CXX DHTTokenUpdateCommand.lo
# CXX DHTUnknownMessage.lo
# CXX ExtensionMessageRegistry.lo
# CXX HandshakeExtensionMessage.lo
# CXX IndexBtMessage.lo
# CXX IndexBtMessageValidator.lo
# CXX InitiatorMSEHandshakeCommand.lo
# CXX LpdDispatchMessageCommand.lo
# CXX LpdMessage.lo
# CXX LpdMessageDispatcher.lo
# CXX LpdMessageReceiver.lo
# CXX LpdReceiveMessageCommand.lo
# CXX magnet.lo
# CXX MSEHandshake.lo
# CXX NameResolveCommand.lo
# CXX Peer.lo
# CXX PeerAbstractCommand.lo
# CXX PeerAddrEntry.lo
# CXX PeerChokeCommand.lo
# CXX PeerConnection.lo
# CXX PeerInitiateConnectionCommand.lo
# CXX PeerInteractionCommand.lo
# CXX PeerListenCommand.lo
# CXX PeerReceiveHandshakeCommand.lo
# CXX PeerSessionResource.lo
# CXX PriorityPieceSelector.lo
# CXX RangeBtMessage.lo
# CXX RangeBtMessageValidator.lo
# CXX ReceiverMSEHandshakeCommand.lo
# CXX RequestSlot.lo
# CXX SeedCheckCommand.lo
# CXX ShareRatioSeedCriteria.lo
# CXX SimpleBtMessage.lo
# CXX TimeSeedCriteria.lo
# CXX TrackerWatcherCommand.lo
# CXX UDPTrackerClient.lo
# CXX UDPTrackerRequest.lo
# CXX UnionSeedCriteria.lo
# CXX UTMetadataDataExtensionMessage.lo
# CXX UTMetadataExtensionMessage.lo
# CXX UTMetadataPostDownloadHandler.lo
# CXX UTMetadataRejectExtensionMessage.lo
# CXX UTMetadataRequestExtensionMessage.lo
# CXX UTMetadataRequestFactory.lo
# CXX UTMetadataRequestTracker.lo
# CXX UTPexExtensionMessage.lo
# CXX ZeroBtMessage.lo
# CXX Metalink2RequestGroup.lo
# CXX MetalinkEntry.lo
# CXX Metalinker.lo
# CXX MetalinkMetaurl.lo
# CXX MetalinkParserController.lo
# CXX MetalinkParserState.lo
# CXX MetalinkParserStateImpl.lo
# CXX MetalinkParserStateMachine.lo
# CXX MetalinkParserStateV3Impl.lo
# CXX MetalinkParserStateV4Impl.lo
# CXX MetalinkPostDownloadHandler.lo
# CXX MetalinkResource.lo
# CXX metalink_helper.lo
# CXX PollEventPoll.lo
# CC getrandom_linux.lo
# CXX main.o
# CXXLD libaria2.la
# ar: `u' modifier ignored since `D' is the default (see `U')
# CXXLD aria2c
# make[3]: Leaving directory '/tmp/aria2/src/aria2-1.24.0/src'
# make[2]: Leaving directory '/tmp/aria2/src/aria2-1.24.0/src'
# Making all in doc
# make[2]: Entering directory '/tmp/aria2/src/aria2-1.24.0/doc'
# Making all in manual-src
# make[3]: Entering directory '/tmp/aria2/src/aria2-1.24.0/doc/manual-src'
# Making all in en
# make[4]: Entering directory '/tmp/aria2/src/aria2-1.24.0/doc/manual-src/en'
# make[4]: Nothing to be done for 'all'.
# make[4]: Leaving directory '/tmp/aria2/src/aria2-1.24.0/doc/manual-src/en'
# Making all in ru
# make[4]: Entering directory '/tmp/aria2/src/aria2-1.24.0/doc/manual-src/ru'
# make[4]: Nothing to be done for 'all'.
# make[4]: Leaving directory '/tmp/aria2/src/aria2-1.24.0/doc/manual-src/ru'
# Making all in pt
# make[4]: Entering directory '/tmp/aria2/src/aria2-1.24.0/doc/manual-src/pt'
# make[4]: Nothing to be done for 'all'.
# make[4]: Leaving directory '/tmp/aria2/src/aria2-1.24.0/doc/manual-src/pt'
# make[4]: Entering directory '/tmp/aria2/src/aria2-1.24.0/doc/manual-src'
# make[4]: Nothing to be done for 'all-am'.
# make[4]: Leaving directory '/tmp/aria2/src/aria2-1.24.0/doc/manual-src'
# make[3]: Leaving directory '/tmp/aria2/src/aria2-1.24.0/doc/manual-src'
# make[3]: Entering directory '/tmp/aria2/src/aria2-1.24.0/doc'
# make[3]: Nothing to be done for 'all-am'.
# make[3]: Leaving directory '/tmp/aria2/src/aria2-1.24.0/doc'
# make[2]: Leaving directory '/tmp/aria2/src/aria2-1.24.0/doc'
# Making all in test
# make[2]: Entering directory '/tmp/aria2/src/aria2-1.24.0/test'
# make[2]: Nothing to be done for 'all'.
# make[2]: Leaving directory '/tmp/aria2/src/aria2-1.24.0/test'
# make[2]: Entering directory '/tmp/aria2/src/aria2-1.24.0'
# make[2]: Leaving directory '/tmp/aria2/src/aria2-1.24.0'
# make[1]: Leaving directory '/tmp/aria2/src/aria2-1.24.0'
# ==> Entering fakeroot environment...
# ==> Starting package()...
# Making install in po
# make[1]: Entering directory '/tmp/aria2/src/aria2-1.24.0/po'
# installing en@quot.gmo as /tmp/aria2/pkg/aria2/usr/share/locale/en@quot/LC_MESSAGES/aria2.mo
# installing en@boldquot.gmo as /tmp/aria2/pkg/aria2/usr/share/locale/en@boldquot/LC_MESSAGES/aria2.mo
# installing ar.gmo as /tmp/aria2/pkg/aria2/usr/share/locale/ar/LC_MESSAGES/aria2.mo
# installing bg.gmo as /tmp/aria2/pkg/aria2/usr/share/locale/bg/LC_MESSAGES/aria2.mo
# installing bn.gmo as /tmp/aria2/pkg/aria2/usr/share/locale/bn/LC_MESSAGES/aria2.mo
# installing ca.gmo as /tmp/aria2/pkg/aria2/usr/share/locale/ca/LC_MESSAGES/aria2.mo
# installing da.gmo as /tmp/aria2/pkg/aria2/usr/share/locale/da/LC_MESSAGES/aria2.mo
# installing de.gmo as /tmp/aria2/pkg/aria2/usr/share/locale/de/LC_MESSAGES/aria2.mo
# installing el.gmo as /tmp/aria2/pkg/aria2/usr/share/locale/el/LC_MESSAGES/aria2.mo
# installing es.gmo as /tmp/aria2/pkg/aria2/usr/share/locale/es/LC_MESSAGES/aria2.mo
# installing fa.gmo as /tmp/aria2/pkg/aria2/usr/share/locale/fa/LC_MESSAGES/aria2.mo
# installing fi.gmo as /tmp/aria2/pkg/aria2/usr/share/locale/fi/LC_MESSAGES/aria2.mo
# installing fil.gmo as /tmp/aria2/pkg/aria2/usr/share/locale/fil/LC_MESSAGES/aria2.mo
# installing fr.gmo as /tmp/aria2/pkg/aria2/usr/share/locale/fr/LC_MESSAGES/aria2.mo
# installing he.gmo as /tmp/aria2/pkg/aria2/usr/share/locale/he/LC_MESSAGES/aria2.mo
# installing hr.gmo as /tmp/aria2/pkg/aria2/usr/share/locale/hr/LC_MESSAGES/aria2.mo
# installing hu.gmo as /tmp/aria2/pkg/aria2/usr/share/locale/hu/LC_MESSAGES/aria2.mo
# installing id.gmo as /tmp/aria2/pkg/aria2/usr/share/locale/id/LC_MESSAGES/aria2.mo
# installing it.gmo as /tmp/aria2/pkg/aria2/usr/share/locale/it/LC_MESSAGES/aria2.mo
# installing ja.gmo as /tmp/aria2/pkg/aria2/usr/share/locale/ja/LC_MESSAGES/aria2.mo
# installing kk.gmo as /tmp/aria2/pkg/aria2/usr/share/locale/kk/LC_MESSAGES/aria2.mo
# installing ko.gmo as /tmp/aria2/pkg/aria2/usr/share/locale/ko/LC_MESSAGES/aria2.mo
# installing ms.gmo as /tmp/aria2/pkg/aria2/usr/share/locale/ms/LC_MESSAGES/aria2.mo
# installing nb.gmo as /tmp/aria2/pkg/aria2/usr/share/locale/nb/LC_MESSAGES/aria2.mo
# installing nl.gmo as /tmp/aria2/pkg/aria2/usr/share/locale/nl/LC_MESSAGES/aria2.mo
# installing nn.gmo as /tmp/aria2/pkg/aria2/usr/share/locale/nn/LC_MESSAGES/aria2.mo
# installing oc.gmo as /tmp/aria2/pkg/aria2/usr/share/locale/oc/LC_MESSAGES/aria2.mo
# installing pl.gmo as /tmp/aria2/pkg/aria2/usr/share/locale/pl/LC_MESSAGES/aria2.mo
# installing pt.gmo as /tmp/aria2/pkg/aria2/usr/share/locale/pt/LC_MESSAGES/aria2.mo
# installing pt_BR.gmo as /tmp/aria2/pkg/aria2/usr/share/locale/pt_BR/LC_MESSAGES/aria2.mo
# installing ro.gmo as /tmp/aria2/pkg/aria2/usr/share/locale/ro/LC_MESSAGES/aria2.mo
# installing ru.gmo as /tmp/aria2/pkg/aria2/usr/share/locale/ru/LC_MESSAGES/aria2.mo
# installing sk.gmo as /tmp/aria2/pkg/aria2/usr/share/locale/sk/LC_MESSAGES/aria2.mo
# installing sr.gmo as /tmp/aria2/pkg/aria2/usr/share/locale/sr/LC_MESSAGES/aria2.mo
# installing sv.gmo as /tmp/aria2/pkg/aria2/usr/share/locale/sv/LC_MESSAGES/aria2.mo
# installing th.gmo as /tmp/aria2/pkg/aria2/usr/share/locale/th/LC_MESSAGES/aria2.mo
# installing tr.gmo as /tmp/aria2/pkg/aria2/usr/share/locale/tr/LC_MESSAGES/aria2.mo
# installing uk.gmo as /tmp/aria2/pkg/aria2/usr/share/locale/uk/LC_MESSAGES/aria2.mo
# installing vi.gmo as /tmp/aria2/pkg/aria2/usr/share/locale/vi/LC_MESSAGES/aria2.mo
# installing zh_CN.gmo as /tmp/aria2/pkg/aria2/usr/share/locale/zh_CN/LC_MESSAGES/aria2.mo
# installing zh_HK.gmo as /tmp/aria2/pkg/aria2/usr/share/locale/zh_HK/LC_MESSAGES/aria2.mo
# installing zh_TW.gmo as /tmp/aria2/pkg/aria2/usr/share/locale/zh_TW/LC_MESSAGES/aria2.mo
# if test "aria2" = "gettext-tools"; then \
# /usr/bin/mkdir -p /tmp/aria2/pkg/aria2/usr/share/gettext/po; \
# for file in Makefile.in.in remove-potcdate.sin quot.sed boldquot.sed en@quot.header en@boldquot.header insert-header.sin Rules-quot Makevars.template; do \
# /usr/bin/install -c -m 644 ./$file \
# /tmp/aria2/pkg/aria2/usr/share/gettext/po/$file; \
# done; \
# for file in Makevars; do \
# rm -f /tmp/aria2/pkg/aria2/usr/share/gettext/po/$file; \
# done; \
# else \
# : ; \
# fi
# make[1]: Leaving directory '/tmp/aria2/src/aria2-1.24.0/po'
# Making install in lib
# make[1]: Entering directory '/tmp/aria2/src/aria2-1.24.0/lib'
# make[2]: Entering directory '/tmp/aria2/src/aria2-1.24.0/lib'
# make[2]: Nothing to be done for 'install-exec-am'.
# make[2]: Nothing to be done for 'install-data-am'.
# make[2]: Leaving directory '/tmp/aria2/src/aria2-1.24.0/lib'
# make[1]: Leaving directory '/tmp/aria2/src/aria2-1.24.0/lib'
# Making install in deps
# make[1]: Entering directory '/tmp/aria2/src/aria2-1.24.0/deps'
# Making install in wslay
# make[2]: Entering directory '/tmp/aria2/src/aria2-1.24.0/deps/wslay'
# Making install in lib
# make[3]: Entering directory '/tmp/aria2/src/aria2-1.24.0/deps/wslay/lib'
# Making install in includes
# make[4]: Entering directory '/tmp/aria2/src/aria2-1.24.0/deps/wslay/lib/includes'
# make[5]: Entering directory '/tmp/aria2/src/aria2-1.24.0/deps/wslay/lib/includes'
# make[5]: Nothing to be done for 'install-exec-am'.
# make[5]: Nothing to be done for 'install-data-am'.
# make[5]: Leaving directory '/tmp/aria2/src/aria2-1.24.0/deps/wslay/lib/includes'
# make[4]: Leaving directory '/tmp/aria2/src/aria2-1.24.0/deps/wslay/lib/includes'
# make[4]: Entering directory '/tmp/aria2/src/aria2-1.24.0/deps/wslay/lib'
# make[5]: Entering directory '/tmp/aria2/src/aria2-1.24.0/deps/wslay/lib'
# make[5]: Nothing to be done for 'install-exec-am'.
# make[5]: Nothing to be done for 'install-data-am'.
# make[5]: Leaving directory '/tmp/aria2/src/aria2-1.24.0/deps/wslay/lib'
# make[4]: Leaving directory '/tmp/aria2/src/aria2-1.24.0/deps/wslay/lib'
# make[3]: Leaving directory '/tmp/aria2/src/aria2-1.24.0/deps/wslay/lib'
# Making install in tests
# make[3]: Entering directory '/tmp/aria2/src/aria2-1.24.0/deps/wslay/tests'
# make[4]: Entering directory '/tmp/aria2/src/aria2-1.24.0/deps/wslay/tests'
# make[4]: Nothing to be done for 'install-exec-am'.
# make[4]: Nothing to be done for 'install-data-am'.
# make[4]: Leaving directory '/tmp/aria2/src/aria2-1.24.0/deps/wslay/tests'
# make[3]: Leaving directory '/tmp/aria2/src/aria2-1.24.0/deps/wslay/tests'
# make[3]: Entering directory '/tmp/aria2/src/aria2-1.24.0/deps/wslay'
# make[4]: Entering directory '/tmp/aria2/src/aria2-1.24.0/deps/wslay'
# make[4]: Nothing to be done for 'install-exec-am'.
# make[4]: Nothing to be done for 'install-data-am'.
# make[4]: Leaving directory '/tmp/aria2/src/aria2-1.24.0/deps/wslay'
# make[3]: Leaving directory '/tmp/aria2/src/aria2-1.24.0/deps/wslay'
# make[2]: Leaving directory '/tmp/aria2/src/aria2-1.24.0/deps/wslay'
# make[2]: Entering directory '/tmp/aria2/src/aria2-1.24.0/deps'
# make[3]: Entering directory '/tmp/aria2/src/aria2-1.24.0/deps'
# make[3]: Nothing to be done for 'install-exec-am'.
# make[3]: Nothing to be done for 'install-data-am'.
# make[3]: Leaving directory '/tmp/aria2/src/aria2-1.24.0/deps'
# make[2]: Leaving directory '/tmp/aria2/src/aria2-1.24.0/deps'
# make[1]: Leaving directory '/tmp/aria2/src/aria2-1.24.0/deps'
# Making install in src
# make[1]: Entering directory '/tmp/aria2/src/aria2-1.24.0/src'
# Making install in includes
# make[2]: Entering directory '/tmp/aria2/src/aria2-1.24.0/src/includes'
# make[3]: Entering directory '/tmp/aria2/src/aria2-1.24.0/src/includes'
# make[3]: Nothing to be done for 'install-exec-am'.
# make[3]: Leaving directory '/tmp/aria2/src/aria2-1.24.0/src/includes'
# make[2]: Leaving directory '/tmp/aria2/src/aria2-1.24.0/src/includes'
# make[2]: Entering directory '/tmp/aria2/src/aria2-1.24.0/src'
# make[3]: Entering directory '/tmp/aria2/src/aria2-1.24.0/src'
# /usr/bin/mkdir -p '/tmp/aria2/pkg/aria2/usr/bin'
# /bin/sh ../libtool --mode=install /usr/bin/install -c aria2c '/tmp/aria2/pkg/aria2/usr/bin'
# libtool: install: /usr/bin/install -c aria2c /tmp/aria2/pkg/aria2/usr/bin/aria2c
# make[3]: Leaving directory '/tmp/aria2/src/aria2-1.24.0/src'
# make[2]: Leaving directory '/tmp/aria2/src/aria2-1.24.0/src'
# make[1]: Leaving directory '/tmp/aria2/src/aria2-1.24.0/src'
# Making install in doc
# make[1]: Entering directory '/tmp/aria2/src/aria2-1.24.0/doc'
# Making install in manual-src
# make[2]: Entering directory '/tmp/aria2/src/aria2-1.24.0/doc/manual-src'
# Making install in en
# make[3]: Entering directory '/tmp/aria2/src/aria2-1.24.0/doc/manual-src/en'
# make[4]: Entering directory '/tmp/aria2/src/aria2-1.24.0/doc/manual-src/en'
# make[4]: Nothing to be done for 'install-exec-am'.
# /usr/bin/mkdir -p '/tmp/aria2/pkg/aria2/usr/share/man/man1'
# /usr/bin/install -c -m 644 _build/man/aria2c.1 '/tmp/aria2/pkg/aria2/usr/share/man/man1'
# make[4]: Leaving directory '/tmp/aria2/src/aria2-1.24.0/doc/manual-src/en'
# make[3]: Leaving directory '/tmp/aria2/src/aria2-1.24.0/doc/manual-src/en'
# Making install in ru
# make[3]: Entering directory '/tmp/aria2/src/aria2-1.24.0/doc/manual-src/ru'
# make[4]: Entering directory '/tmp/aria2/src/aria2-1.24.0/doc/manual-src/ru'
# make[4]: Nothing to be done for 'install-exec-am'.
# /usr/bin/mkdir -p '/tmp/aria2/pkg/aria2/usr/share/man/ru/man1'
# /usr/bin/install -c -m 644 _build/man/aria2c.1 '/tmp/aria2/pkg/aria2/usr/share/man/ru/man1'
# make[4]: Leaving directory '/tmp/aria2/src/aria2-1.24.0/doc/manual-src/ru'
# make[3]: Leaving directory '/tmp/aria2/src/aria2-1.24.0/doc/manual-src/ru'
# Making install in pt
# make[3]: Entering directory '/tmp/aria2/src/aria2-1.24.0/doc/manual-src/pt'
# make[4]: Entering directory '/tmp/aria2/src/aria2-1.24.0/doc/manual-src/pt'
# make[4]: Nothing to be done for 'install-exec-am'.
# /usr/bin/mkdir -p '/tmp/aria2/pkg/aria2/usr/share/man/pt/man1'
# /usr/bin/install -c -m 644 _build/man/aria2c.1 '/tmp/aria2/pkg/aria2/usr/share/man/pt/man1'
# make[4]: Leaving directory '/tmp/aria2/src/aria2-1.24.0/doc/manual-src/pt'
# make[3]: Leaving directory '/tmp/aria2/src/aria2-1.24.0/doc/manual-src/pt'
# make[3]: Entering directory '/tmp/aria2/src/aria2-1.24.0/doc/manual-src'
# make[4]: Entering directory '/tmp/aria2/src/aria2-1.24.0/doc/manual-src'
# make[4]: Nothing to be done for 'install-exec-am'.
# make[4]: Nothing to be done for 'install-data-am'.
# make[4]: Leaving directory '/tmp/aria2/src/aria2-1.24.0/doc/manual-src'
# make[3]: Leaving directory '/tmp/aria2/src/aria2-1.24.0/doc/manual-src'
# make[2]: Leaving directory '/tmp/aria2/src/aria2-1.24.0/doc/manual-src'
# make[2]: Entering directory '/tmp/aria2/src/aria2-1.24.0/doc'
# make[3]: Entering directory '/tmp/aria2/src/aria2-1.24.0/doc'
# make[3]: Nothing to be done for 'install-exec-am'.
# /usr/bin/mkdir -p '/tmp/aria2/pkg/aria2/usr/share/doc/aria2/bash_completion'
# /usr/bin/mkdir -p '/tmp/aria2/pkg/aria2/usr/share/doc/aria2/bash_completion'
# /usr/bin/install -c -m 644 bash_completion/aria2c '/tmp/aria2/pkg/aria2/usr/share/doc/aria2/bash_completion'
# /usr/bin/install -c -m 644 bash_completion/README.txt '/tmp/aria2/pkg/aria2/usr/share/doc/aria2/bash_completion'
# /usr/bin/mkdir -p '/tmp/aria2/pkg/aria2/usr/share/doc/aria2/xmlrpc'
# /usr/bin/install -c -m 644 xmlrpc/aria2mon xmlrpc/aria2rpc xmlrpc/README.txt '/tmp/aria2/pkg/aria2/usr/share/doc/aria2/xmlrpc'
# make[3]: Leaving directory '/tmp/aria2/src/aria2-1.24.0/doc'
# make[2]: Leaving directory '/tmp/aria2/src/aria2-1.24.0/doc'
# make[1]: Leaving directory '/tmp/aria2/src/aria2-1.24.0/doc'
# Making install in test
# make[1]: Entering directory '/tmp/aria2/src/aria2-1.24.0/test'
# make[2]: Entering directory '/tmp/aria2/src/aria2-1.24.0/test'
# make[2]: Nothing to be done for 'install-exec-am'.
# make[2]: Nothing to be done for 'install-data-am'.
# make[2]: Leaving directory '/tmp/aria2/src/aria2-1.24.0/test'
# make[1]: Leaving directory '/tmp/aria2/src/aria2-1.24.0/test'
# make[1]: Entering directory '/tmp/aria2/src/aria2-1.24.0'
# make[2]: Entering directory '/tmp/aria2/src/aria2-1.24.0'
# make[2]: Nothing to be done for 'install-exec-am'.
# /usr/bin/mkdir -p '/tmp/aria2/pkg/aria2/usr/share/doc/aria2'
# /usr/bin/install -c -m 644 README README.rst README.html '/tmp/aria2/pkg/aria2/usr/share/doc/aria2'
# make[2]: Leaving directory '/tmp/aria2/src/aria2-1.24.0'
# make[1]: Leaving directory '/tmp/aria2/src/aria2-1.24.0'
# ==> Tidying install...
# -> Removing doc files...
# -> Purging unwanted files...
# ==> Checking for packaging issue...
# ==> Creating package "aria2"...
# -> Generating .PKGINFO file...
# -> Generating .BUILDINFO file...
# error: invalid option '--noprogressbar'
# -> Generating .MTREE file...
# -> Compressing package...
# ==> Leaving fakeroot environment.
# ==> Finished making: aria2 1.24.0-1 (Wed Aug 24 14:23:02 UTC 2016)

CMD: pacman --query --file aria2-1.24.0-1-x86_64.pkg.tar.xz
# aria2 1.24.0-1

Creating hybrid package for 'aria2'

Trying to find vanilla package 'aria2'...

CMD: pacman --query --file /mirror/aria2-1.24.0-1.pkg.tar.xz
# aria2 1.24.0-1

Package file has the following structure:
# /.PKGINFO
# /.BUILDINFO
# /.MTREE
# /usr/share/locale/en@quot/LC_MESSAGES/aria2.mo
# /usr/share/locale/en@boldquot/LC_MESSAGES/aria2.mo
# /usr/share/locale/ar/LC_MESSAGES/aria2.mo
# /usr/share/locale/bg/LC_MESSAGES/aria2.mo
# /usr/share/locale/bn/LC_MESSAGES/aria2.mo
# /usr/share/locale/ca/LC_MESSAGES/aria2.mo
# /usr/share/locale/da/LC_MESSAGES/aria2.mo
# /usr/share/locale/de/LC_MESSAGES/aria2.mo
# /usr/share/locale/el/LC_MESSAGES/aria2.mo
# /usr/share/locale/es/LC_MESSAGES/aria2.mo
# /usr/share/locale/fa/LC_MESSAGES/aria2.mo
# /usr/share/locale/fi/LC_MESSAGES/aria2.mo
# /usr/share/locale/fil/LC_MESSAGES/aria2.mo
# /usr/share/locale/fr/LC_MESSAGES/aria2.mo
# /usr/share/locale/he/LC_MESSAGES/aria2.mo
# /usr/share/locale/hr/LC_MESSAGES/aria2.mo
# /usr/share/locale/hu/LC_MESSAGES/aria2.mo
# /usr/share/locale/id/LC_MESSAGES/aria2.mo
# /usr/share/locale/it/LC_MESSAGES/aria2.mo
# /usr/share/locale/ja/LC_MESSAGES/aria2.mo
# /usr/share/locale/kk/LC_MESSAGES/aria2.mo
# /usr/share/locale/ko/LC_MESSAGES/aria2.mo
# /usr/share/locale/ms/LC_MESSAGES/aria2.mo
# /usr/share/locale/nb/LC_MESSAGES/aria2.mo
# /usr/share/locale/nl/LC_MESSAGES/aria2.mo
# /usr/share/locale/nn/LC_MESSAGES/aria2.mo
# /usr/share/locale/oc/LC_MESSAGES/aria2.mo
# /usr/share/locale/pl/LC_MESSAGES/aria2.mo
# /usr/share/locale/pt/LC_MESSAGES/aria2.mo
# /usr/share/locale/pt_BR/LC_MESSAGES/aria2.mo
# /usr/share/locale/ro/LC_MESSAGES/aria2.mo
# /usr/share/locale/ru/LC_MESSAGES/aria2.mo
# /usr/share/locale/sk/LC_MESSAGES/aria2.mo
# /usr/share/locale/sr/LC_MESSAGES/aria2.mo
# /usr/share/locale/sv/LC_MESSAGES/aria2.mo
# /usr/share/locale/th/LC_MESSAGES/aria2.mo
# /usr/share/locale/tr/LC_MESSAGES/aria2.mo
# /usr/share/locale/uk/LC_MESSAGES/aria2.mo
# /usr/share/locale/vi/LC_MESSAGES/aria2.mo
# /usr/share/locale/zh_CN/LC_MESSAGES/aria2.mo
# /usr/share/locale/zh_HK/LC_MESSAGES/aria2.mo
# /usr/share/locale/zh_TW/LC_MESSAGES/aria2.mo
# /usr/share/man/man1/aria2c.1.gz
# /usr/share/man/ru/man1/aria2c.1.gz
# /usr/share/man/pt/man1/aria2c.1.gz
# /usr/share/doc/aria2/README
# /usr/share/doc/aria2/README.rst
# /usr/share/doc/aria2/README.html
# /usr/share/doc/aria2/xmlrpc/aria2mon
# /usr/share/doc/aria2/xmlrpc/aria2rpc
# /usr/share/doc/aria2/xmlrpc/README.txt
# /usr/share/bash-completion/completions/aria2c
# /usr/bin/aria2c

Generating .MTREE

CMD: bsdtar -czf .MTREE --format=mtree --options=!all,use-set,type,uid,mode,time,size,md5,sha256,link .PKGINFO .BUILDINFO usr

Tar-ing up files

CMD: bsdtar -cf - .PKGINFO .BUILDINFO usr .MTREE

CMD: xz -c -z

Successfully ran bsdtar -cf - .PKGINFO .BUILDINFO usr .MTREE | xz -c -z

CMD: bsdtar -tqf aria2.pkg.tar.xz .PKGINFO
# .PKGINFO

Created package at path /var/cache/pacman/pkg/aria2.pkg.tar.xz

Attempting to access local repository, attempt 1

CMD: repo-add /var/cache/pacman/pkg/tuscan.db.tar /var/cache/pacman/pkg/aria2.pkg.tar.xz
# ==> Extracting database to a temporary location...
# ==> Extracting database to a temporary location...
# ==> Adding package '/var/cache/pacman/pkg/aria2.pkg.tar.xz'
# -> Computing checksums...
# -> Creating 'desc' db entry...
# -> Creating 'files' db entry...
# ==> Creating updated database file '/var/cache/pacman/pkg/tuscan.db.tar'

Printing config logfiles

CMD: config logfiles '/tmp/aria2/src/aria2-1.24.0/config.log'
# This file contains any messages produced by compilers while
# running configure, to aid debugging if configure makes a mistake.
#
# It was created by aria2 configure 1.24.0, which was
# generated by GNU Autoconf 2.69. Invocation command line was
#
# $ ./configure --host=x86_64-unknown-linux --prefix=/usr --with-ca-bundle=/etc/ssl/certs/ca-certificates.crt
#
# ## --------- ##
# ## Platform. ##
# ## --------- ##
#
# hostname = 70d2195c0d75
# uname -m = x86_64
# uname -r = 4.7.1-1-ARCH
# uname -s = Linux
# uname -v = #1 SMP PREEMPT Wed Aug 17 08:13:35 CEST 2016
#
# /usr/bin/uname -p = unknown
# /bin/uname -X = unknown
#
# /bin/arch = unknown
# /usr/bin/arch -k = unknown
# /usr/convex/getsysinfo = unknown
# /usr/bin/hostinfo = unknown
# /bin/machine = unknown
# /usr/bin/oslevel = unknown
# /bin/universe = unknown
#
# PATH: /usr/local/sbin
# PATH: /usr/local/bin
# PATH: /usr/bin
# PATH: /usr/lib/jvm/default/bin
# PATH: /usr/bin/site_perl
# PATH: /usr/bin/vendor_perl
# PATH: /usr/bin/core_perl
#
#
# ## ----------- ##
# ## Core tests. ##
# ## ----------- ##
#
# configure:3263: checking build system type
# configure:3277: result: x86_64-pc-linux-gnu
# configure:3297: checking host system type
# configure:3310: result: x86_64-unknown-linux-gnu
# configure:3330: checking target system type
# configure:3343: result: x86_64-unknown-linux-gnu
# configure:3386: checking for a BSD-compatible install
# configure:3454: result: /usr/bin/install -c
# configure:3465: checking whether build environment is sane
# configure:3520: result: yes
# configure:3579: checking for x86_64-unknown-linux-strip
# configure:3609: result: no
# configure:3619: checking for strip
# configure:3635: found /usr/bin/strip
# configure:3646: result: strip
# configure:3671: checking for a thread-safe mkdir -p
# configure:3710: result: /usr/bin/mkdir -p
# configure:3717: checking for gawk
# configure:3733: found /usr/bin/gawk
# configure:3744: result: gawk
# configure:3755: checking whether make sets $(MAKE)
# configure:3777: result: yes
# configure:3806: checking whether make supports nested variables
# configure:3823: result: yes
# configure:3960: checking whether make supports nested variables
# configure:3977: result: yes
# configure:4001: checking for style of include used by make
# configure:4029: result: GNU
# configure:4060: checking for x86_64-unknown-linux-gcc
# configure:4090: result: no
# configure:4100: checking for gcc
# configure:4116: found /usr/bin/gcc
# configure:4127: result: gcc
# configure:4356: checking for C compiler version
# configure:4365: gcc --version >&5
# gcc (GCC) 6.1.1 20160602
# Copyright (C) 2016 Free Software Foundation, Inc.
# This is free software; see the source for copying conditions. There is NO
# warranty; not even for MERCHANTABILITY or FITNESS FOR A PARTICULAR PURPOSE.
#
# configure:4376: $? = 0
# configure:4365: gcc -v >&5
# Using built-in specs.
# COLLECT_GCC=gcc
# COLLECT_LTO_WRAPPER=/usr/lib/gcc/x86_64-pc-linux-gnu/6.1.1/lto-wrapper
# Target: x86_64-pc-linux-gnu
# Configured with: /build/gcc/src/gcc/configure --prefix=/usr --libdir=/usr/lib --libexecdir=/usr/lib --mandir=/usr/share/man --infodir=/usr/share/info --with-bugurl=https://bugs.archlinux.org/ --enable-languages=c,c++,ada,fortran,go,lto,objc,obj-c++ --enable-shared --enable-threads=posix --enable-libmpx --with-system-zlib --with-isl --enable-__cxa_atexit --disable-libunwind-exceptions --enable-clocale=gnu --disable-libstdcxx-pch --disable-libssp --enable-gnu-unique-object --enable-linker-build-id --enable-lto --enable-plugin --enable-install-libiberty --with-linker-hash-style=gnu --enable-gnu-indirect-function --disable-multilib --disable-werror --enable-checking=release
# Thread model: posix
# gcc version 6.1.1 20160602 (GCC)
# configure:4376: $? = 0
# configure:4365: gcc -V >&5
# gcc: error: unrecognized command line option '-V'
# gcc: fatal error: no input files
# compilation terminated.
# configure:4376: $? = 1
# configure:4365: gcc -qversion >&5
# gcc: error: unrecognized command line option '-qversion'; did you mean '--version'?
# gcc: fatal error: no input files
# compilation terminated.
# configure:4376: $? = 1
# configure:4396: checking whether the C compiler works
# configure:4418: gcc conftest.c >&5
# configure:4422: $? = 0
# configure:4470: result: yes
# configure:4473: checking for C compiler default output file name
# configure:4475: result: a.out
# configure:4481: checking for suffix of executables
# configure:4488: gcc -o conftest conftest.c >&5
# configure:4492: $? = 0
# configure:4514: result:
# configure:4536: checking whether we are cross compiling
# configure:4544: gcc -o conftest conftest.c >&5
# configure:4548: $? = 0
# configure:4555: ./conftest
# configure:4559: $? = 0
# configure:4574: result: no
# configure:4579: checking for suffix of object files
# configure:4601: gcc -c conftest.c >&5
# configure:4605: $? = 0
# configure:4626: result: o
# configure:4630: checking whether we are using the GNU C compiler
# configure:4649: gcc -c conftest.c >&5
# configure:4649: $? = 0
# configure:4658: result: yes
# configure:4667: checking whether gcc accepts -g
# configure:4687: gcc -c -g conftest.c >&5
# configure:4687: $? = 0
# configure:4728: result: yes
# configure:4745: checking for gcc option to accept ISO C89
# configure:4808: gcc -c conftest.c >&5
# configure:4808: $? = 0
# configure:4821: result: none needed
# configure:4846: checking whether gcc understands -c and -o together
# configure:4868: gcc -c conftest.c -o conftest2.o
# configure:4871: $? = 0
# configure:4868: gcc -c conftest.c -o conftest2.o
# configure:4871: $? = 0
# configure:4883: result: yes
# configure:4902: checking dependency style of gcc
# configure:5013: result: gcc3
# configure:5034: checking how to run the C preprocessor
# configure:5065: gcc -E conftest.c
# configure:5065: $? = 0
# configure:5079: gcc -E conftest.c
# conftest.c:11:28: fatal error: ac_nonexistent.h: No such file or directory
# #include
# ^
# compilation terminated.
# configure:5079: $? = 1
# configure: failed program was:
# | /* confdefs.h */
# | #define PACKAGE_NAME "aria2"
# | #define PACKAGE_TARNAME "aria2"
# | #define PACKAGE_VERSION "1.24.0"
# | #define PACKAGE_STRING "aria2 1.24.0"
# | #define PACKAGE_BUGREPORT "https://github.com/aria2/aria2/issues"
# | #define PACKAGE_URL "https://aria2.github.io/"
# | #define PACKAGE "aria2"
# | #define VERSION "1.24.0"
# | /* end confdefs.h. */
# | #include
# configure:5104: result: gcc -E
# configure:5124: gcc -E conftest.c
# configure:5124: $? = 0
# configure:5138: gcc -E conftest.c
# conftest.c:11:28: fatal error: ac_nonexistent.h: No such file or directory
# #include
# ^
# compilation terminated.
# configure:5138: $? = 1
# configure: failed program was:
# | /* confdefs.h */
# | #define PACKAGE_NAME "aria2"
# | #define PACKAGE_TARNAME "aria2"
# | #define PACKAGE_VERSION "1.24.0"
# | #define PACKAGE_STRING "aria2 1.24.0"
# | #define PACKAGE_BUGREPORT "https://github.com/aria2/aria2/issues"
# | #define PACKAGE_URL "https://aria2.github.io/"
# | #define PACKAGE "aria2"
# | #define VERSION "1.24.0"
# | /* end confdefs.h. */
# | #include
# configure:5167: checking for grep that handles long lines and -e
# configure:5225: result: /usr/bin/grep
# configure:5230: checking for egrep
# configure:5292: result: /usr/bin/grep -E
# configure:5297: checking for ANSI C header files
# configure:5317: gcc -c conftest.c >&5
# configure:5317: $? = 0
# configure:5390: gcc -o conftest conftest.c >&5
# configure:5390: $? = 0
# configure:5390: ./conftest
# configure:5390: $? = 0
# configure:5401: result: yes
# configure:5414: checking for sys/types.h
# configure:5414: gcc -c conftest.c >&5
# configure:5414: $? = 0
# configure:5414: result: yes
# configure:5414: checking for sys/stat.h
# configure:5414: gcc -c conftest.c >&5
# configure:5414: $? = 0
# configure:5414: result: yes
# configure:5414: checking for stdlib.h
# configure:5414: gcc -c conftest.c >&5
# configure:5414: $? = 0
# configure:5414: result: yes
# configure:5414: checking for string.h
# configure:5414: gcc -c conftest.c >&5
# configure:5414: $? = 0
# configure:5414: result: yes
# configure:5414: checking for memory.h
# configure:5414: gcc -c conftest.c >&5
# configure:5414: $? = 0
# configure:5414: result: yes
# configure:5414: checking for strings.h
# configure:5414: gcc -c conftest.c >&5
# configure:5414: $? = 0
# configure:5414: result: yes
# configure:5414: checking for inttypes.h
# configure:5414: gcc -c conftest.c >&5
# configure:5414: $? = 0
# configure:5414: result: yes
# configure:5414: checking for stdint.h
# configure:5414: gcc -c conftest.c >&5
# configure:5414: $? = 0
# configure:5414: result: yes
# configure:5414: checking for unistd.h
# configure:5414: gcc -c conftest.c >&5
# configure:5414: $? = 0
# configure:5414: result: yes
# configure:5427: checking minix/config.h usability
# configure:5427: gcc -c conftest.c >&5
# conftest.c:54:26: fatal error: minix/config.h: No such file or directory
# #include
# ^
# compilation terminated.
# configure:5427: $? = 1
# configure: failed program was:
# | /* confdefs.h */
# | #define PACKAGE_NAME "aria2"
# | #define PACKAGE_TARNAME "aria2"
# | #define PACKAGE_VERSION "1.24.0"
# | #define PACKAGE_STRING "aria2 1.24.0"
# | #define PACKAGE_BUGREPORT "https://github.com/aria2/aria2/issues"
# | #define PACKAGE_URL "https://aria2.github.io/"
# | #define PACKAGE "aria2"
# | #define VERSION "1.24.0"
# | #define STDC_HEADERS 1
# | #define HAVE_SYS_TYPES_H 1
# | #define HAVE_SYS_STAT_H 1
# | #define HAVE_STDLIB_H 1
# | #define HAVE_STRING_H 1
# | #define HAVE_MEMORY_H 1
# | #define HAVE_STRINGS_H 1
# | #define HAVE_INTTYPES_H 1
# | #define HAVE_STDINT_H 1
# | #define HAVE_UNISTD_H 1
# | /* end confdefs.h. */
# | #include
# | #ifdef HAVE_SYS_TYPES_H
# | # include
# | #endif
# | #ifdef HAVE_SYS_STAT_H
# | # include
# | #endif
# | #ifdef STDC_HEADERS
# | # include
# | # include
# | #else
# | # ifdef HAVE_STDLIB_H
# | # include
# | # endif
# | #endif
# | #ifdef HAVE_STRING_H
# | # if !defined STDC_HEADERS && defined HAVE_MEMORY_H
# | # include
# | # endif
# | # include
# | #endif
# | #ifdef HAVE_STRINGS_H
# | # include
# | #endif
# | #ifdef HAVE_INTTYPES_H
# | # include
# | #endif
# | #ifdef HAVE_STDINT_H
# | # include
# | #endif
# | #ifdef HAVE_UNISTD_H
# | # include
# | #endif
# | #include
# configure:5427: result: no
# configure:5427: checking minix/config.h presence
# configure:5427: gcc -E conftest.c
# conftest.c:21:26: fatal error: minix/config.h: No such file or directory
# #include
# ^
# compilation terminated.
# configure:5427: $? = 1
# configure: failed program was:
# | /* confdefs.h */
# | #define PACKAGE_NAME "aria2"
# | #define PACKAGE_TARNAME "aria2"
# | #define PACKAGE_VERSION "1.24.0"
# | #define PACKAGE_STRING "aria2 1.24.0"
# | #define PACKAGE_BUGREPORT "https://github.com/aria2/aria2/issues"
# | #define PACKAGE_URL "https://aria2.github.io/"
# | #define PACKAGE "aria2"
# | #define VERSION "1.24.0"
# | #define STDC_HEADERS 1
# | #define HAVE_SYS_TYPES_H 1
# | #define HAVE_SYS_STAT_H 1
# | #define HAVE_STDLIB_H 1
# | #define HAVE_STRING_H 1
# | #define HAVE_MEMORY_H 1
# | #define HAVE_STRINGS_H 1
# | #define HAVE_INTTYPES_H 1
# | #define HAVE_STDINT_H 1
# | #define HAVE_UNISTD_H 1
# | /* end confdefs.h. */
# | #include
# configure:5427: result: no
# configure:5427: checking for minix/config.h
# configure:5427: result: no
# configure:5448: checking whether it is safe to define __EXTENSIONS__
# configure:5466: gcc -c conftest.c >&5
# configure:5466: $? = 0
# configure:5473: result: yes
# configure:5535: checking how to print strings
# configure:5562: result: printf
# configure:5583: checking for a sed that does not truncate output
# configure:5647: result: /usr/bin/sed
# configure:5665: checking for fgrep
# configure:5727: result: /usr/bin/grep -F
# configure:5762: checking for ld used by gcc
# configure:5829: result: /usr/bin/ld
# configure:5836: checking if the linker (/usr/bin/ld) is GNU ld
# configure:5851: result: yes
# configure:5863: checking for BSD- or MS-compatible name lister (nm)
# configure:5917: result: no
# configure:5931: checking for x86_64-unknown-linux-dumpbin
# configure:5961: result: no
# configure:5931: checking for x86_64-unknown-linux-link
# configure:5961: result: no
# configure:5975: checking for dumpbin
# configure:6005: result: no
# configure:5975: checking for link
# configure:5991: found /usr/bin/link
# configure:6002: result: link -dump
# configure:6047: checking the name lister (nm) interface
# configure:6054: gcc -c conftest.c >&5
# configure:6057: nm "conftest.o"
# configure:6060: output
# 0000000000000000 B some_variable
# configure:6067: result: BSD nm
# configure:6070: checking whether ln -s works
# configure:6074: result: yes
# configure:6082: checking the maximum length of command line arguments
# configure:6213: result: 1572864
# configure:6261: checking how to convert x86_64-pc-linux-gnu file names to x86_64-unknown-linux-gnu format
# configure:6301: result: func_convert_file_noop
# configure:6308: checking how to convert x86_64-pc-linux-gnu file names to toolchain format
# configure:6328: result: func_convert_file_noop
# configure:6335: checking for /usr/bin/ld option to reload object files
# configure:6342: result: -r
# configure:6376: checking for x86_64-unknown-linux-objdump
# configure:6406: result: no
# configure:6416: checking for objdump
# configure:6432: found /usr/bin/objdump
# configure:6443: result: objdump
# configure:6475: checking how to recognize dependent libraries
# configure:6675: result: pass_all
# configure:6720: checking for x86_64-unknown-linux-dlltool
# configure:6750: result: no
# configure:6760: checking for dlltool
# configure:6790: result: no
# configure:6820: checking how to associate runtime and link libraries
# configure:6847: result: printf %s\n
# configure:6863: checking for x86_64-unknown-linux-ar
# configure:6893: result: no
# configure:6907: checking for ar
# configure:6923: found /usr/bin/ar
# configure:6934: result: ar
# configure:6971: checking for archiver @FILE support
# configure:6988: gcc -c conftest.c >&5
# configure:6988: $? = 0
# configure:6991: ar cru libconftest.a @conftest.lst >&5
# ar: `u' modifier ignored since `D' is the default (see `U')
# configure:6994: $? = 0
# configure:6999: ar cru libconftest.a @conftest.lst >&5
# ar: `u' modifier ignored since `D' is the default (see `U')
# ar: conftest.o: No such file or directory
# configure:7002: $? = 1
# configure:7014: result: @
# configure:7032: checking for x86_64-unknown-linux-strip
# configure:7059: result: strip
# configure:7131: checking for x86_64-unknown-linux-ranlib
# configure:7161: result: no
# configure:7171: checking for ranlib
# configure:7187: found /usr/bin/ranlib
# configure:7198: result: ranlib
# configure:7300: checking command to parse nm output from gcc object
# configure:7453: gcc -c conftest.c >&5
# configure:7456: $? = 0
# configure:7460: nm conftest.o \| sed -n -e 's/^.*[ ]\([ABCDGIRSTW][ABCDGIRSTW]*\)[ ][ ]*\([_A-Za-z][_A-Za-z0-9]*\)$/\1 \2 \2/p' | sed '/ __gnu_lto/d' \> conftest.nm
# configure:7463: $? = 0
# configure:7529: gcc -o conftest conftest.c conftstm.o >&5
# configure:7532: $? = 0
# configure:7570: result: ok
# configure:7617: checking for sysroot
# configure:7647: result: no
# configure:7654: checking for a working dd
# configure:7692: result: /usr/bin/dd
# configure:7696: checking how to truncate binary pipes
# configure:7711: result: /usr/bin/dd bs=4096 count=1
# configure:7847: gcc -c conftest.c >&5
# configure:7850: $? = 0
# configure:8000: checking for x86_64-unknown-linux-mt
# configure:8030: result: no
# configure:8040: checking for mt
# configure:8070: result: no
# configure:8090: checking if : is a manifest tool
# configure:8096: : '-?'
# configure:8104: result: no
# configure:8778: checking for dlfcn.h
# configure:8778: gcc -c conftest.c >&5
# configure:8778: $? = 0
# configure:8778: result: yes
# configure:9033: checking for objdir
# configure:9048: result: .libs
# configure:9312: checking if gcc supports -fno-rtti -fno-exceptions
# configure:9330: gcc -c -fno-rtti -fno-exceptions conftest.c >&5
# cc1: warning: command line option '-fno-rtti' is valid for C++/ObjC++ but not for C
# configure:9334: $? = 0
# configure:9347: result: no
# configure:9705: checking for gcc option to produce PIC
# configure:9712: result: -fPIC -DPIC
# configure:9720: checking if gcc PIC flag -fPIC -DPIC works
# configure:9738: gcc -c -fPIC -DPIC -DPIC conftest.c >&5
# configure:9742: $? = 0
# configure:9755: result: yes
# configure:9784: checking if gcc static flag -static works
# configure:9812: result: yes
# configure:9827: checking if gcc supports -c -o file.o
# configure:9848: gcc -c -o out/conftest2.o conftest.c >&5
# configure:9852: $? = 0
# configure:9874: result: yes
# configure:9882: checking if gcc supports -c -o file.o
# configure:9929: result: yes
# configure:9962: checking whether the gcc linker (/usr/bin/ld -m elf_x86_64) supports shared libraries
# configure:11225: result: yes
# configure:11262: checking whether -lc should be explicitly linked in
# configure:11270: gcc -c conftest.c >&5
# configure:11273: $? = 0
# configure:11288: gcc -shared -fPIC -DPIC conftest.o -v -Wl,-soname -Wl,conftest -o conftest 2\>\&1 \| /usr/bin/grep -lc \>/dev/null 2\>\&1
# configure:11291: $? = 0
# configure:11305: result: no
# configure:11465: checking dynamic linker characteristics
# configure:12046: gcc -o conftest -Wl,-rpath -Wl,/foo conftest.c >&5
# configure:12046: $? = 0
# configure:12295: result: GNU/Linux ld.so
# configure:12417: checking how to hardcode library paths into programs
# configure:12442: result: immediate
# configure:12990: checking whether stripping libraries is possible
# configure:12995: result: yes
# configure:13030: checking if libtool supports shared libraries
# configure:13032: result: yes
# configure:13035: checking whether to build shared libraries
# configure:13060: result: yes
# configure:13063: checking whether to build static libraries
# configure:13067: result: no
# configure:13146: checking for cppunit-config
# configure:13177: result: no
# configure:13187: checking for Cppunit - version >= 1.10.2
# configure:13191: result: no
# configure:13562: checking for x86_64-unknown-linux-g++
# configure:13592: result: no
# configure:13562: checking for x86_64-unknown-linux-c++
# configure:13592: result: no
# configure:13562: checking for x86_64-unknown-linux-gpp
# configure:13592: result: no
# configure:13562: checking for x86_64-unknown-linux-aCC
# configure:13592: result: no
# configure:13562: checking for x86_64-unknown-linux-CC
# configure:13592: result: no
# configure:13562: checking for x86_64-unknown-linux-cxx
# configure:13592: result: no
# configure:13562: checking for x86_64-unknown-linux-cc++
# configure:13592: result: no
# configure:13562: checking for x86_64-unknown-linux-cl.exe
# configure:13592: result: no
# configure:13562: checking for x86_64-unknown-linux-FCC
# configure:13592: result: no
# configure:13562: checking for x86_64-unknown-linux-KCC
# configure:13592: result: no
# configure:13562: checking for x86_64-unknown-linux-RCC
# configure:13592: result: no
# configure:13562: checking for x86_64-unknown-linux-xlC_r
# configure:13592: result: no
# configure:13562: checking for x86_64-unknown-linux-xlC
# configure:13592: result: no
# configure:13606: checking for g++
# configure:13622: found /usr/bin/g++
# configure:13633: result: g++
# configure:13660: checking for C++ compiler version
# configure:13669: g++ --version >&5
# g++ (GCC) 6.1.1 20160602
# Copyright (C) 2016 Free Software Foundation, Inc.
# This is free software; see the source for copying conditions. There is NO
# warranty; not even for MERCHANTABILITY or FITNESS FOR A PARTICULAR PURPOSE.
#
# configure:13680: $? = 0
# configure:13669: g++ -v >&5
# Using built-in specs.
# COLLECT_GCC=g++
# COLLECT_LTO_WRAPPER=/usr/lib/gcc/x86_64-pc-linux-gnu/6.1.1/lto-wrapper
# Target: x86_64-pc-linux-gnu
# Configured with: /build/gcc/src/gcc/configure --prefix=/usr --libdir=/usr/lib --libexecdir=/usr/lib --mandir=/usr/share/man --infodir=/usr/share/info --with-bugurl=https://bugs.archlinux.org/ --enable-languages=c,c++,ada,fortran,go,lto,objc,obj-c++ --enable-shared --enable-threads=posix --enable-libmpx --with-system-zlib --with-isl --enable-__cxa_atexit --disable-libunwind-exceptions --enable-clocale=gnu --disable-libstdcxx-pch --disable-libssp --enable-gnu-unique-object --enable-linker-build-id --enable-lto --enable-plugin --enable-install-libiberty --with-linker-hash-style=gnu --enable-gnu-indirect-function --disable-multilib --disable-werror --enable-checking=release
# Thread model: posix
# gcc version 6.1.1 20160602 (GCC)
# configure:13680: $? = 0
# configure:13669: g++ -V >&5
# g++: error: unrecognized command line option '-V'
# g++: fatal error: no input files
# compilation terminated.
# configure:13680: $? = 1
# configure:13669: g++ -qversion >&5
# g++: error: unrecognized command line option '-qversion'; did you mean '--version'?
# g++: fatal error: no input files
# compilation terminated.
# configure:13680: $? = 1
# configure:13684: checking whether we are using the GNU C++ compiler
# configure:13703: g++ -c conftest.cpp >&5
# configure:13703: $? = 0
# configure:13712: result: yes
# configure:13721: checking whether g++ accepts -g
# configure:13741: g++ -c -g conftest.cpp >&5
# configure:13741: $? = 0
# configure:13782: result: yes
# configure:13807: checking dependency style of g++
# configure:13918: result: gcc3
# configure:13951: checking how to run the C++ preprocessor
# configure:13978: g++ -E conftest.cpp
# configure:13978: $? = 0
# configure:13992: g++ -E conftest.cpp
# conftest.cpp:32:28: fatal error: ac_nonexistent.h: No such file or directory
# #include
# ^
# compilation terminated.
# configure:13992: $? = 1
# configure: failed program was:
# | /* confdefs.h */
# | #define PACKAGE_NAME "aria2"
# | #define PACKAGE_TARNAME "aria2"
# | #define PACKAGE_VERSION "1.24.0"
# | #define PACKAGE_STRING "aria2 1.24.0"
# | #define PACKAGE_BUGREPORT "https://github.com/aria2/aria2/issues"
# | #define PACKAGE_URL "https://aria2.github.io/"
# | #define PACKAGE "aria2"
# | #define VERSION "1.24.0"
# | #define STDC_HEADERS 1
# | #define HAVE_SYS_TYPES_H 1
# | #define HAVE_SYS_STAT_H 1
# | #define HAVE_STDLIB_H 1
# | #define HAVE_STRING_H 1
# | #define HAVE_MEMORY_H 1
# | #define HAVE_STRINGS_H 1
# | #define HAVE_INTTYPES_H 1
# | #define HAVE_STDINT_H 1
# | #define HAVE_UNISTD_H 1
# | #define __EXTENSIONS__ 1
# | #define _ALL_SOURCE 1
# | #define _GNU_SOURCE 1
# | #define _POSIX_PTHREAD_SEMANTICS 1
# | #define _TANDEM_SOURCE 1
# | #define HAVE_DLFCN_H 1
# | #define LT_OBJDIR ".libs/"
# | #define BUILD "x86_64-pc-linux-gnu"
# | #define HOST "x86_64-unknown-linux-gnu"
# | #define TARGET "x86_64-unknown-linux-gnu"
# | #define CA_BUNDLE "/etc/ssl/certs/ca-certificates.crt"
# | /* end confdefs.h. */
# | #include
# configure:14017: result: g++ -E
# configure:14037: g++ -E conftest.cpp
# configure:14037: $? = 0
# configure:14051: g++ -E conftest.cpp
# conftest.cpp:32:28: fatal error: ac_nonexistent.h: No such file or directory
# #include
# ^
# compilation terminated.
# configure:14051: $? = 1
# configure: failed program was:
# | /* confdefs.h */
# | #define PACKAGE_NAME "aria2"
# | #define PACKAGE_TARNAME "aria2"
# | #define PACKAGE_VERSION "1.24.0"
# | #define PACKAGE_STRING "aria2 1.24.0"
# | #define PACKAGE_BUGREPORT "https://github.com/aria2/aria2/issues"
# | #define PACKAGE_URL "https://aria2.github.io/"
# | #define PACKAGE "aria2"
# | #define VERSION "1.24.0"
# | #define STDC_HEADERS 1
# | #define HAVE_SYS_TYPES_H 1
# | #define HAVE_SYS_STAT_H 1
# | #define HAVE_STDLIB_H 1
# | #define HAVE_STRING_H 1
# | #define HAVE_MEMORY_H 1
# | #define HAVE_STRINGS_H 1
# | #define HAVE_INTTYPES_H 1
# | #define HAVE_STDINT_H 1
# | #define HAVE_UNISTD_H 1
# | #define __EXTENSIONS__ 1
# | #define _ALL_SOURCE 1
# | #define _GNU_SOURCE 1
# | #define _POSIX_PTHREAD_SEMANTICS 1
# | #define _TANDEM_SOURCE 1
# | #define HAVE_DLFCN_H 1
# | #define LT_OBJDIR ".libs/"
# | #define BUILD "x86_64-pc-linux-gnu"
# | #define HOST "x86_64-unknown-linux-gnu"
# | #define TARGET "x86_64-unknown-linux-gnu"
# | #define CA_BUNDLE "/etc/ssl/certs/ca-certificates.crt"
# | /* end confdefs.h. */
# | #include
# configure:14213: checking for ld used by g++
# configure:14280: result: /usr/bin/ld -m elf_x86_64
# configure:14287: checking if the linker (/usr/bin/ld -m elf_x86_64) is GNU ld
# configure:14302: result: yes
# configure:14357: checking whether the g++ linker (/usr/bin/ld -m elf_x86_64) supports shared libraries
# configure:15430: result: yes
# configure:15466: g++ -c conftest.cpp >&5
# configure:15469: $? = 0
# configure:15950: checking for g++ option to produce PIC
# configure:15957: result: -fPIC -DPIC
# configure:15965: checking if g++ PIC flag -fPIC -DPIC works
# configure:15983: g++ -c -fPIC -DPIC -DPIC conftest.cpp >&5
# configure:15987: $? = 0
# configure:16000: result: yes
# configure:16023: checking if g++ static flag -static works
# configure:16051: result: yes
# configure:16063: checking if g++ supports -c -o file.o
# configure:16084: g++ -c -o out/conftest2.o conftest.cpp >&5
# configure:16088: $? = 0
# configure:16110: result: yes
# configure:16115: checking if g++ supports -c -o file.o
# configure:16162: result: yes
# configure:16192: checking whether the g++ linker (/usr/bin/ld -m elf_x86_64) supports shared libraries
# configure:16235: result: yes
# configure:16376: checking dynamic linker characteristics
# configure:17133: result: GNU/Linux ld.so
# configure:17198: checking how to hardcode library paths into programs
# configure:17223: result: immediate
# configure:17271: checking for x86_64-unknown-linux-gcc
# configure:17298: result: gcc
# configure:17567: checking for C compiler version
# configure:17576: gcc --version >&5
# gcc (GCC) 6.1.1 20160602
# Copyright (C) 2016 Free Software Foundation, Inc.
# This is free software; see the source for copying conditions. There is NO
# warranty; not even for MERCHANTABILITY or FITNESS FOR A PARTICULAR PURPOSE.
#
# configure:17587: $? = 0
# configure:17576: gcc -v >&5
# Using built-in specs.
# COLLECT_GCC=gcc
# COLLECT_LTO_WRAPPER=/usr/lib/gcc/x86_64-pc-linux-gnu/6.1.1/lto-wrapper
# Target: x86_64-pc-linux-gnu
# Configured with: /build/gcc/src/gcc/configure --prefix=/usr --libdir=/usr/lib --libexecdir=/usr/lib --mandir=/usr/share/man --infodir=/usr/share/info --with-bugurl=https://bugs.archlinux.org/ --enable-languages=c,c++,ada,fortran,go,lto,objc,obj-c++ --enable-shared --enable-threads=posix --enable-libmpx --with-system-zlib --with-isl --enable-__cxa_atexit --disable-libunwind-exceptions --enable-clocale=gnu --disable-libstdcxx-pch --disable-libssp --enable-gnu-unique-object --enable-linker-build-id --enable-lto --enable-plugin --enable-install-libiberty --with-linker-hash-style=gnu --enable-gnu-indirect-function --disable-multilib --disable-werror --enable-checking=release
# Thread model: posix
# gcc version 6.1.1 20160602 (GCC)
# configure:17587: $? = 0
# configure:17576: gcc -V >&5
# gcc: error: unrecognized command line option '-V'
# gcc: fatal error: no input files
# compilation terminated.
# configure:17587: $? = 1
# configure:17576: gcc -qversion >&5
# gcc: error: unrecognized command line option '-qversion'; did you mean '--version'?
# gcc: fatal error: no input files
# compilation terminated.
# configure:17587: $? = 1
# configure:17591: checking whether we are using the GNU C compiler
# configure:17619: result: yes
# configure:17628: checking whether gcc accepts -g
# configure:17689: result: yes
# configure:17706: checking for gcc option to accept ISO C89
# configure:17782: result: none needed
# configure:17807: checking whether gcc understands -c and -o together
# configure:17844: result: yes
# configure:17863: checking dependency style of gcc
# configure:17974: result: gcc3
# configure:17995: checking for bison
# configure:18011: found /usr/bin/bison
# configure:18022: result: bison -y
# configure:18043: checking dependency style of gcc
# configure:18152: result: gcc3
# configure:18179: checking for x86_64-unknown-linux-ar
# configure:18206: result: ar
# configure:18280: checking for sphinx-build
# configure:18313: result: no
# configure:18335: checking for rst2html.py
# configure:18368: result: no
# configure:18335: checking for rst2html
# configure:18368: result: no
# configure:18406: checking for x86_64-unknown-linux-pkg-config
# configure:18439: result: no
# configure:18449: checking for pkg-config
# configure:18467: found /usr/bin/pkg-config
# configure:18479: result: /usr/bin/pkg-config
# configure:18504: checking pkg-config is at least version 0.20
# configure:18507: result: yes
# configure:18527: checking whether g++ supports C++11 features by default
# configure:18558: g++ -c conftest.cpp >&5
# configure:18558: $? = 0
# configure:18565: result: yes
# configure:18663: checking whether the c++ compiler supports nullptr
# configure:18679: g++ -c conftest.cpp >&5
# configure:18679: $? = 0
# configure:18692: checking whether the C++ compiler supports `override` keyword
# configure:18714: g++ -c conftest.cpp >&5
# configure:18714: $? = 0
# configure:18716: result: yes
# configure:18750: checking for ZLIB
# configure:18757: $PKG_CONFIG --exists --print-errors "zlib >= 1.2.3"
# configure:18760: $? = 0
# configure:18774: $PKG_CONFIG --exists --print-errors "zlib >= 1.2.3"
# configure:18777: $? = 0
# configure:18815: result: yes
# configure:18887: checking whether gzbuffer is declared
# configure:18887: g++ -c conftest.cpp >&5
# configure:18887: $? = 0
# configure:18887: result: yes
# configure:18894: checking for gzbuffer
# configure:18894: g++ -o conftest conftest.cpp -lz >&5
# configure:18894: $? = 0
# configure:18894: result: yes
# configure:18902: checking for gzsetparams
# configure:18902: g++ -o conftest conftest.cpp -lz >&5
# configure:18902: $? = 0
# configure:18902: result: yes
# configure:19207: checking for xml2-config
# configure:19225: found /usr/bin/xml2-config
# configure:19238: result: /usr/bin/xml2-config
# configure:19247: checking for libxml - version >= 2.6.24
# configure:19349: g++ -o conftest -I/usr/include/libxml2 conftest.cpp -lxml2 -lz -llzma -lm -ldl >&5
# configure:19349: $? = 0
# configure:19349: ./conftest
# configure:19349: $? = 0
# configure:19364: result: yes (version 2.9.4)
# configure:19513: checking for SQLITE3
# configure:19520: $PKG_CONFIG --exists --print-errors "sqlite3"
# configure:19523: $? = 0
# configure:19537: $PKG_CONFIG --exists --print-errors "sqlite3"
# configure:19540: $? = 0
# configure:19578: result: yes
# configure:19590: checking for sqlite3_open_v2
# configure:19590: g++ -o conftest conftest.cpp -lsqlite3 >&5
# configure:19590: $? = 0
# configure:19590: result: yes
# configure:19663: checking whether to enable Mac OS X native SSL/TLS
# configure:19677: result: no
# configure:19690: checking for main in -lcrypt32
# configure:19709: g++ -o conftest conftest.cpp -lcrypt32 >&5
# /usr/bin/ld: cannot find -lcrypt32
# collect2: error: ld returned 1 exit status
# configure:19709: $? = 1
# configure: failed program was:
# | /* confdefs.h */
# | #define PACKAGE_NAME "aria2"
# | #define PACKAGE_TARNAME "aria2"
# | #define PACKAGE_VERSION "1.24.0"
# | #define PACKAGE_STRING "aria2 1.24.0"
# | #define PACKAGE_BUGREPORT "https://github.com/aria2/aria2/issues"
# | #define PACKAGE_URL "https://aria2.github.io/"
# | #define PACKAGE "aria2"
# | #define VERSION "1.24.0"
# | #define STDC_HEADERS 1
# | #define HAVE_SYS_TYPES_H 1
# | #define HAVE_SYS_STAT_H 1
# | #define HAVE_STDLIB_H 1
# | #define HAVE_STRING_H 1
# | #define HAVE_MEMORY_H 1
# | #define HAVE_STRINGS_H 1
# | #define HAVE_INTTYPES_H 1
# | #define HAVE_STDINT_H 1
# | #define HAVE_UNISTD_H 1
# | #define __EXTENSIONS__ 1
# | #define _ALL_SOURCE 1
# | #define _GNU_SOURCE 1
# | #define _POSIX_PTHREAD_SEMANTICS 1
# | #define _TANDEM_SOURCE 1
# | #define HAVE_DLFCN_H 1
# | #define LT_OBJDIR ".libs/"
# | #define BUILD "x86_64-pc-linux-gnu"
# | #define HOST "x86_64-unknown-linux-gnu"
# | #define TARGET "x86_64-unknown-linux-gnu"
# | #define CA_BUNDLE "/etc/ssl/certs/ca-certificates.crt"
# | #define CXX11_OVERRIDE override
# | #define HAVE_ZLIB 1
# | #define HAVE_GZSETPARAMS 1
# | #define HAVE_LIBXML2 1
# | #define HAVE_SQLITE3 1
# | #define HAVE_SQLITE3_OPEN_V2 1
# | /* end confdefs.h. */
# |
# |
# | int
# | main ()
# | {
# | return main ();
# | ;
# | return 0;
# | }
# configure:19718: result: no
# configure:19727: checking for main in -lsecur32
# configure:19746: g++ -o conftest conftest.cpp -lsecur32 >&5
# /usr/bin/ld: cannot find -lsecur32
# collect2: error: ld returned 1 exit status
# configure:19746: $? = 1
# configure: failed program was:
# | /* confdefs.h */
# | #define PACKAGE_NAME "aria2"
# | #define PACKAGE_TARNAME "aria2"
# | #define PACKAGE_VERSION "1.24.0"
# | #define PACKAGE_STRING "aria2 1.24.0"
# | #define PACKAGE_BUGREPORT "https://github.com/aria2/aria2/issues"
# | #define PACKAGE_URL "https://aria2.github.io/"
# | #define PACKAGE "aria2"
# | #define VERSION "1.24.0"
# | #define STDC_HEADERS 1
# | #define HAVE_SYS_TYPES_H 1
# | #define HAVE_SYS_STAT_H 1
# | #define HAVE_STDLIB_H 1
# | #define HAVE_STRING_H 1
# | #define HAVE_MEMORY_H 1
# | #define HAVE_STRINGS_H 1
# | #define HAVE_INTTYPES_H 1
# | #define HAVE_STDINT_H 1
# | #define HAVE_UNISTD_H 1
# | #define __EXTENSIONS__ 1
# | #define _ALL_SOURCE 1
# | #define _GNU_SOURCE 1
# | #define _POSIX_PTHREAD_SEMANTICS 1
# | #define _TANDEM_SOURCE 1
# | #define HAVE_DLFCN_H 1
# | #define LT_OBJDIR ".libs/"
# | #define BUILD "x86_64-pc-linux-gnu"
# | #define HOST "x86_64-unknown-linux-gnu"
# | #define TARGET "x86_64-unknown-linux-gnu"
# | #define CA_BUNDLE "/etc/ssl/certs/ca-certificates.crt"
# | #define CXX11_OVERRIDE override
# | #define HAVE_ZLIB 1
# | #define HAVE_GZSETPARAMS 1
# | #define HAVE_LIBXML2 1
# | #define HAVE_SQLITE3 1
# | #define HAVE_SQLITE3_OPEN_V2 1
# | /* end confdefs.h. */
# |
# |
# | int
# | main ()
# | {
# | return main ();
# | ;
# | return 0;
# | }
# configure:19755: result: no
# configure:19764: checking for main in -ladvapi32
# configure:19783: g++ -o conftest conftest.cpp -ladvapi32 >&5
# /usr/bin/ld: cannot find -ladvapi32
# collect2: error: ld returned 1 exit status
# configure:19783: $? = 1
# configure: failed program was:
# | /* confdefs.h */
# | #define PACKAGE_NAME "aria2"
# | #define PACKAGE_TARNAME "aria2"
# | #define PACKAGE_VERSION "1.24.0"
# | #define PACKAGE_STRING "aria2 1.24.0"
# | #define PACKAGE_BUGREPORT "https://github.com/aria2/aria2/issues"
# | #define PACKAGE_URL "https://aria2.github.io/"
# | #define PACKAGE "aria2"
# | #define VERSION "1.24.0"
# | #define STDC_HEADERS 1
# | #define HAVE_SYS_TYPES_H 1
# | #define HAVE_SYS_STAT_H 1
# | #define HAVE_STDLIB_H 1
# | #define HAVE_STRING_H 1
# | #define HAVE_MEMORY_H 1
# | #define HAVE_STRINGS_H 1
# | #define HAVE_INTTYPES_H 1
# | #define HAVE_STDINT_H 1
# | #define HAVE_UNISTD_H 1
# | #define __EXTENSIONS__ 1
# | #define _ALL_SOURCE 1
# | #define _GNU_SOURCE 1
# | #define _POSIX_PTHREAD_SEMANTICS 1
# | #define _TANDEM_SOURCE 1
# | #define HAVE_DLFCN_H 1
# | #define LT_OBJDIR ".libs/"
# | #define BUILD "x86_64-pc-linux-gnu"
# | #define HOST "x86_64-unknown-linux-gnu"
# | #define TARGET "x86_64-unknown-linux-gnu"
# | #define CA_BUNDLE "/etc/ssl/certs/ca-certificates.crt"
# | #define CXX11_OVERRIDE override
# | #define HAVE_ZLIB 1
# | #define HAVE_GZSETPARAMS 1
# | #define HAVE_LIBXML2 1
# | #define HAVE_SQLITE3 1
# | #define HAVE_SQLITE3_OPEN_V2 1
# | /* end confdefs.h. */
# |
# |
# | int
# | main ()
# | {
# | return main ();
# | ;
# | return 0;
# | }
# configure:19792: result: no
# configure:19801: checking for wincrypt.h
# configure:19801: g++ -c conftest.cpp >&5
# conftest.cpp:44:22: fatal error: wincrypt.h: No such file or directory
# #include
# ^
# compilation terminated.
# configure:19801: $? = 1
# configure: failed program was:
# | /* confdefs.h */
# | #define PACKAGE_NAME "aria2"
# | #define PACKAGE_TARNAME "aria2"
# | #define PACKAGE_VERSION "1.24.0"
# | #define PACKAGE_STRING "aria2 1.24.0"
# | #define PACKAGE_BUGREPORT "https://github.com/aria2/aria2/issues"
# | #define PACKAGE_URL "https://aria2.github.io/"
# | #define PACKAGE "aria2"
# | #define VERSION "1.24.0"
# | #define STDC_HEADERS 1
# | #define HAVE_SYS_TYPES_H 1
# | #define HAVE_SYS_STAT_H 1
# | #define HAVE_STDLIB_H 1
# | #define HAVE_STRING_H 1
# | #define HAVE_MEMORY_H 1
# | #define HAVE_STRINGS_H 1
# | #define HAVE_INTTYPES_H 1
# | #define HAVE_STDINT_H 1
# | #define HAVE_UNISTD_H 1
# | #define __EXTENSIONS__ 1
# | #define _ALL_SOURCE 1
# | #define _GNU_SOURCE 1
# | #define _POSIX_PTHREAD_SEMANTICS 1
# | #define _TANDEM_SOURCE 1
# | #define HAVE_DLFCN_H 1
# | #define LT_OBJDIR ".libs/"
# | #define BUILD "x86_64-pc-linux-gnu"
# | #define HOST "x86_64-unknown-linux-gnu"
# | #define TARGET "x86_64-unknown-linux-gnu"
# | #define CA_BUNDLE "/etc/ssl/certs/ca-certificates.crt"
# | #define CXX11_OVERRIDE override
# | #define HAVE_ZLIB 1
# | #define HAVE_GZSETPARAMS 1
# | #define HAVE_LIBXML2 1
# | #define HAVE_SQLITE3 1
# | #define HAVE_SQLITE3_OPEN_V2 1
# | /* end confdefs.h. */
# |
# | #ifdef HAVE_WINDOWS_H
# | # include
# | #endif
# |
# |
# | #include
# configure:19801: result: no
# configure:19814: checking for security.h
# configure:19814: g++ -c conftest.cpp >&5
# conftest.cpp:47:22: fatal error: security.h: No such file or directory
# #include
# ^
# compilation terminated.
# configure:19814: $? = 1
# configure: failed program was:
# | /* confdefs.h */
# | #define PACKAGE_NAME "aria2"
# | #define PACKAGE_TARNAME "aria2"
# | #define PACKAGE_VERSION "1.24.0"
# | #define PACKAGE_STRING "aria2 1.24.0"
# | #define PACKAGE_BUGREPORT "https://github.com/aria2/aria2/issues"
# | #define PACKAGE_URL "https://aria2.github.io/"
# | #define PACKAGE "aria2"
# | #define VERSION "1.24.0"
# | #define STDC_HEADERS 1
# | #define HAVE_SYS_TYPES_H 1
# | #define HAVE_SYS_STAT_H 1
# | #define HAVE_STDLIB_H 1
# | #define HAVE_STRING_H 1
# | #define HAVE_MEMORY_H 1
# | #define HAVE_STRINGS_H 1
# | #define HAVE_INTTYPES_H 1
# | #define HAVE_STDINT_H 1
# | #define HAVE_UNISTD_H 1
# | #define __EXTENSIONS__ 1
# | #define _ALL_SOURCE 1
# | #define _GNU_SOURCE 1
# | #define _POSIX_PTHREAD_SEMANTICS 1
# | #define _TANDEM_SOURCE 1
# | #define HAVE_DLFCN_H 1
# | #define LT_OBJDIR ".libs/"
# | #define BUILD "x86_64-pc-linux-gnu"
# | #define HOST "x86_64-unknown-linux-gnu"
# | #define TARGET "x86_64-unknown-linux-gnu"
# | #define CA_BUNDLE "/etc/ssl/certs/ca-certificates.crt"
# | #define CXX11_OVERRIDE override
# | #define HAVE_ZLIB 1
# | #define HAVE_GZSETPARAMS 1
# | #define HAVE_LIBXML2 1
# | #define HAVE_SQLITE3 1
# | #define HAVE_SQLITE3_OPEN_V2 1
# | /* end confdefs.h. */
# |
# | #ifdef HAVE_WINDOWS_H
# | # include
# | #endif
# | #ifndef SECURITY_WIN32
# | #define SECURITY_WIN32 1
# | #endif
# |
# |
# | #include
# configure:19814: result: no
# configure:19860: checking for LIBGNUTLS
# configure:19867: $PKG_CONFIG --exists --print-errors "gnutls >= 2.2.0"
# configure:19870: $? = 0
# configure:19884: $PKG_CONFIG --exists --print-errors "gnutls >= 2.2.0"
# configure:19887: $? = 0
# configure:19925: result: yes
# configure:19938: checking for gnutls_certificate_set_x509_system_trust
# configure:19938: g++ -o conftest conftest.cpp -lgnutls >&5
# configure:19938: $? = 0
# configure:19938: result: yes
# configure:20120: checking for nettle_sha1_init in -lnettle
# configure:20145: g++ -o conftest conftest.cpp -lnettle >&5
# configure:20145: $? = 0
# configure:20154: result: yes
# configure:20176: checking for __gmpz_init in -lgmp
# configure:20201: g++ -o conftest conftest.cpp -lgmp >&5
# configure:20201: $? = 0
# configure:20210: result: yes
# configure:20230: checking for __gmpz_powm_sec
# configure:20230: g++ -o conftest conftest.cpp -lgmp >&5
# configure:20230: $? = 0
# configure:20230: result: yes
# configure:20443: checking for LIBSSH2
# configure:20450: $PKG_CONFIG --exists --print-errors "libssh2"
# configure:20453: $? = 0
# configure:20467: $PKG_CONFIG --exists --print-errors "libssh2"
# configure:20470: $? = 0
# configure:20508: result: yes
# configure:20532: checking for LIBCARES
# configure:20539: $PKG_CONFIG --exists --print-errors "libcares >= 1.7.0"
# configure:20542: $? = 0
# configure:20556: $PKG_CONFIG --exists --print-errors "libcares >= 1.7.0"
# configure:20559: $? = 0
# configure:20597: result: yes
# configure:20609: checking for ares_addr_node
# configure:20609: g++ -c conftest.cpp >&5
# configure:20609: $? = 0
# configure:20609: g++ -c conftest.cpp >&5
# conftest.cpp: In function 'int main()':
# conftest.cpp:51:28: error: expected primary-expression before ')' token
# if (sizeof ((ares_addr_node)))
# ^
# configure:20609: $? = 1
# configure: failed program was:
# | /* confdefs.h */
# | #define PACKAGE_NAME "aria2"
# | #define PACKAGE_TARNAME "aria2"
# | #define PACKAGE_VERSION "1.24.0"
# | #define PACKAGE_STRING "aria2 1.24.0"
# | #define PACKAGE_BUGREPORT "https://github.com/aria2/aria2/issues"
# | #define PACKAGE_URL "https://aria2.github.io/"
# | #define PACKAGE "aria2"
# | #define VERSION "1.24.0"
# | #define STDC_HEADERS 1
# | #define HAVE_SYS_TYPES_H 1
# | #define HAVE_SYS_STAT_H 1
# | #define HAVE_STDLIB_H 1
# | #define HAVE_STRING_H 1
# | #define HAVE_MEMORY_H 1
# | #define HAVE_STRINGS_H 1
# | #define HAVE_INTTYPES_H 1
# | #define HAVE_STDINT_H 1
# | #define HAVE_UNISTD_H 1
# | #define __EXTENSIONS__ 1
# | #define _ALL_SOURCE 1
# | #define _GNU_SOURCE 1
# | #define _POSIX_PTHREAD_SEMANTICS 1
# | #define _TANDEM_SOURCE 1
# | #define HAVE_DLFCN_H 1
# | #define LT_OBJDIR ".libs/"
# | #define BUILD "x86_64-pc-linux-gnu"
# | #define HOST "x86_64-unknown-linux-gnu"
# | #define TARGET "x86_64-unknown-linux-gnu"
# | #define CA_BUNDLE "/etc/ssl/certs/ca-certificates.crt"
# | #define CXX11_OVERRIDE override
# | #define HAVE_ZLIB 1
# | #define HAVE_GZSETPARAMS 1
# | #define HAVE_LIBXML2 1
# | #define HAVE_SQLITE3 1
# | #define HAVE_SQLITE3_OPEN_V2 1
# | #define HAVE_LIBGNUTLS 1
# | #define HAVE_GNUTLS_CERTIFICATE_SET_X509_SYSTEM_TRUST 1
# | #define HAVE_LIBNETTLE 1
# | #define HAVE_LIBGMP 1
# | #define HAVE___GMPZ_POWM_SEC 1
# | #define HAVE_GMP_SEC 1
# | #define HAVE_LIBSSH2 1
# | #define HAVE_LIBCARES 1
# | /* end confdefs.h. */
# | #include
# |
# | int
# | main ()
# | {
# | if (sizeof ((ares_addr_node)))
# | return 0;
# | ;
# | return 0;
# | }
# configure:20609: result: yes
# configure:20622: checking for ares_set_servers
# configure:20622: g++ -o conftest conftest.cpp -lcares >&5
# configure:20622: $? = 0
# configure:20622: result: yes
# configure:21104: checking for size_t
# configure:21104: g++ -c conftest.cpp >&5
# configure:21104: $? = 0
# configure:21104: g++ -c conftest.cpp >&5
# conftest.cpp: In function 'int main()':
# conftest.cpp:90:20: error: expected primary-expression before ')' token
# if (sizeof ((size_t)))
# ^
# configure:21104: $? = 1
# configure: failed program was:
# | /* confdefs.h */
# | #define PACKAGE_NAME "aria2"
# | #define PACKAGE_TARNAME "aria2"
# | #define PACKAGE_VERSION "1.24.0"
# | #define PACKAGE_STRING "aria2 1.24.0"
# | #define PACKAGE_BUGREPORT "https://github.com/aria2/aria2/issues"
# | #define PACKAGE_URL "https://aria2.github.io/"
# | #define PACKAGE "aria2"
# | #define VERSION "1.24.0"
# | #define STDC_HEADERS 1
# | #define HAVE_SYS_TYPES_H 1
# | #define HAVE_SYS_STAT_H 1
# | #define HAVE_STDLIB_H 1
# | #define HAVE_STRING_H 1
# | #define HAVE_MEMORY_H 1
# | #define HAVE_STRINGS_H 1
# | #define HAVE_INTTYPES_H 1
# | #define HAVE_STDINT_H 1
# | #define HAVE_UNISTD_H 1
# | #define __EXTENSIONS__ 1
# | #define _ALL_SOURCE 1
# | #define _GNU_SOURCE 1
# | #define _POSIX_PTHREAD_SEMANTICS 1
# | #define _TANDEM_SOURCE 1
# | #define HAVE_DLFCN_H 1
# | #define LT_OBJDIR ".libs/"
# | #define BUILD "x86_64-pc-linux-gnu"
# | #define HOST "x86_64-unknown-linux-gnu"
# | #define TARGET "x86_64-unknown-linux-gnu"
# | #define CA_BUNDLE "/etc/ssl/certs/ca-certificates.crt"
# | #define CXX11_OVERRIDE override
# | #define HAVE_ZLIB 1
# | #define HAVE_GZSETPARAMS 1
# | #define HAVE_LIBXML2 1
# | #define HAVE_SQLITE3 1
# | #define HAVE_SQLITE3_OPEN_V2 1
# | #define HAVE_LIBGNUTLS 1
# | #define HAVE_GNUTLS_CERTIFICATE_SET_X509_SYSTEM_TRUST 1
# | #define HAVE_LIBNETTLE 1
# | #define HAVE_LIBGMP 1
# | #define HAVE___GMPZ_POWM_SEC 1
# | #define HAVE_GMP_SEC 1
# | #define HAVE_LIBSSH2 1
# | #define HAVE_LIBCARES 1
# | #define HAVE_ARES_ADDR_NODE 1
# | #define HAVE_ARES_SET_SERVERS 1
# | #define USE_LIBNETTLE_MD 1
# | #define ENABLE_SSL 1
# | #define ENABLE_BITTORRENT 1
# | #define ENABLE_METALINK 1
# | #define ENABLE_XML_RPC 1
# | #define ENABLE_ASYNC_DNS 1
# | /* end confdefs.h. */
# | #include
# | #ifdef HAVE_SYS_TYPES_H
# | # include
# | #endif
# | #ifdef HAVE_SYS_STAT_H
# | # include
# | #endif
# | #ifdef STDC_HEADERS
# | # include
# | # include
# | #else
# | # ifdef HAVE_STDLIB_H
# | # include
# | # endif
# | #endif
# | #ifdef HAVE_STRING_H
# | # if !defined STDC_HEADERS && defined HAVE_MEMORY_H
# | # include
# | # endif
# | # include
# | #endif
# | #ifdef HAVE_STRINGS_H
# | # include
# | #endif
# | #ifdef HAVE_INTTYPES_H
# | # include
# | #endif
# | #ifdef HAVE_STDINT_H
# | # include
# | #endif
# | #ifdef HAVE_UNISTD_H
# | # include
# | #endif
# | int
# | main ()
# | {
# | if (sizeof ((size_t)))
# | return 0;
# | ;
# | return 0;
# | }
# configure:21104: result: yes
# configure:21117: checking for working alloca.h
# configure:21134: g++ -o conftest conftest.cpp >&5
# configure:21134: $? = 0
# configure:21142: result: yes
# configure:21150: checking for alloca
# configure:21187: g++ -o conftest conftest.cpp >&5
# configure:21187: $? = 0
# configure:21195: result: yes
# configure:21301: checking for ANSI C header files
# configure:21405: result: yes
# configure:21453: checking argz.h usability
# configure:21453: g++ -c conftest.cpp >&5
# configure:21453: $? = 0
# configure:21453: result: yes
# configure:21453: checking argz.h presence
# configure:21453: g++ -E conftest.cpp
# configure:21453: $? = 0
# configure:21453: result: yes
# configure:21453: checking for argz.h
# configure:21453: result: yes
# configure:21453: checking arpa/inet.h usability
# configure:21453: g++ -c conftest.cpp >&5
# configure:21453: $? = 0
# configure:21453: result: yes
# configure:21453: checking arpa/inet.h presence
# configure:21453: g++ -E conftest.cpp
# configure:21453: $? = 0
# configure:21453: result: yes
# configure:21453: checking for arpa/inet.h
# configure:21453: result: yes
# configure:21453: checking fcntl.h usability
# configure:21453: g++ -c conftest.cpp >&5
# configure:21453: $? = 0
# configure:21453: result: yes
# configure:21453: checking fcntl.h presence
# configure:21453: g++ -E conftest.cpp
# configure:21453: $? = 0
# configure:21453: result: yes
# configure:21453: checking for fcntl.h
# configure:21453: result: yes
# configure:21453: checking float.h usability
# configure:21453: g++ -c conftest.cpp >&5
# configure:21453: $? = 0
# configure:21453: result: yes
# configure:21453: checking float.h presence
# configure:21453: g++ -E conftest.cpp
# configure:21453: $? = 0
# configure:21453: result: yes
# configure:21453: checking for float.h
# configure:21453: result: yes
# configure:21453: checking for inttypes.h
# configure:21453: result: yes
# configure:21453: checking langinfo.h usability
# configure:21453: g++ -c conftest.cpp >&5
# configure:21453: $? = 0
# configure:21453: result: yes
# configure:21453: checking langinfo.h presence
# configure:21453: g++ -E conftest.cpp
# configure:21453: $? = 0
# configure:21453: result: yes
# configure:21453: checking for langinfo.h
# configure:21453: result: yes
# configure:21453: checking libintl.h usability
# configure:21453: g++ -c conftest.cpp >&5
# configure:21453: $? = 0
# configure:21453: result: yes
# configure:21453: checking libintl.h presence
# configure:21453: g++ -E conftest.cpp
# configure:21453: $? = 0
# configure:21453: result: yes
# configure:21453: checking for libintl.h
# configure:21453: result: yes
# configure:21453: checking limits.h usability
# configure:21453: g++ -c conftest.cpp >&5
# configure:21453: $? = 0
# configure:21453: result: yes
# configure:21453: checking limits.h presence
# configure:21453: g++ -E conftest.cpp
# configure:21453: $? = 0
# configure:21453: result: yes
# configure:21453: checking for limits.h
# configure:21453: result: yes
# configure:21453: checking locale.h usability
# configure:21453: g++ -c conftest.cpp >&5
# configure:21453: $? = 0
# configure:21453: result: yes
# configure:21453: checking locale.h presence
# configure:21453: g++ -E conftest.cpp
# configure:21453: $? = 0
# configure:21453: result: yes
# configure:21453: checking for locale.h
# configure:21453: result: yes
# configure:21453: checking malloc.h usability
# configure:21453: g++ -c conftest.cpp >&5
# configure:21453: $? = 0
# configure:21453: result: yes
# configure:21453: checking malloc.h presence
# configure:21453: g++ -E conftest.cpp
# configure:21453: $? = 0
# configure:21453: result: yes
# configure:21453: checking for malloc.h
# configure:21453: result: yes
# configure:21453: checking netdb.h usability
# configure:21453: g++ -c conftest.cpp >&5
# configure:21453: $? = 0
# configure:21453: result: yes
# configure:21453: checking netdb.h presence
# configure:21453: g++ -E conftest.cpp
# configure:21453: $? = 0
# configure:21453: result: yes
# configure:21453: checking for netdb.h
# configure:21453: result: yes
# configure:21453: checking netinet/in.h usability
# configure:21453: g++ -c conftest.cpp >&5
# configure:21453: $? = 0
# configure:21453: result: yes
# configure:21453: checking netinet/in.h presence
# configure:21453: g++ -E conftest.cpp
# configure:21453: $? = 0
# configure:21453: result: yes
# configure:21453: checking for netinet/in.h
# configure:21453: result: yes
# configure:21453: checking netinet/tcp.h usability
# configure:21453: g++ -c conftest.cpp >&5
# configure:21453: $? = 0
# configure:21453: result: yes
# configure:21453: checking netinet/tcp.h presence
# configure:21453: g++ -E conftest.cpp
# configure:21453: $? = 0
# configure:21453: result: yes
# configure:21453: checking for netinet/tcp.h
# configure:21453: result: yes
# configure:21453: checking poll.h usability
# configure:21453: g++ -c conftest.cpp >&5
# configure:21453: $? = 0
# configure:21453: result: yes
# configure:21453: checking poll.h presence
# configure:21453: g++ -E conftest.cpp
# configure:21453: $? = 0
# configure:21453: result: yes
# configure:21453: checking for poll.h
# configure:21453: result: yes
# configure:21453: checking port.h usability
# configure:21453: g++ -c conftest.cpp >&5
# conftest.cpp:104:18: fatal error: port.h: No such file or directory
# #include
# ^
# compilation terminated.
# configure:21453: $? = 1
# configure: failed program was:
# | /* confdefs.h */
# | #define PACKAGE_NAME "aria2"
# | #define PACKAGE_TARNAME "aria2"
# | #define PACKAGE_VERSION "1.24.0"
# | #define PACKAGE_STRING "aria2 1.24.0"
# | #define PACKAGE_BUGREPORT "https://github.com/aria2/aria2/issues"
# | #define PACKAGE_URL "https://aria2.github.io/"
# | #define PACKAGE "aria2"
# | #define VERSION "1.24.0"
# | #define STDC_HEADERS 1
# | #define HAVE_SYS_TYPES_H 1
# | #define HAVE_SYS_STAT_H 1
# | #define HAVE_STDLIB_H 1
# | #define HAVE_STRING_H 1
# | #define HAVE_MEMORY_H 1
# | #define HAVE_STRINGS_H 1
# | #define HAVE_INTTYPES_H 1
# | #define HAVE_STDINT_H 1
# | #define HAVE_UNISTD_H 1
# | #define __EXTENSIONS__ 1
# | #define _ALL_SOURCE 1
# | #define _GNU_SOURCE 1
# | #define _POSIX_PTHREAD_SEMANTICS 1
# | #define _TANDEM_SOURCE 1
# | #define HAVE_DLFCN_H 1
# | #define LT_OBJDIR ".libs/"
# | #define BUILD "x86_64-pc-linux-gnu"
# | #define HOST "x86_64-unknown-linux-gnu"
# | #define TARGET "x86_64-unknown-linux-gnu"
# | #define CA_BUNDLE "/etc/ssl/certs/ca-certificates.crt"
# | #define CXX11_OVERRIDE override
# | #define HAVE_ZLIB 1
# | #define HAVE_GZSETPARAMS 1
# | #define HAVE_LIBXML2 1
# | #define HAVE_SQLITE3 1
# | #define HAVE_SQLITE3_OPEN_V2 1
# | #define HAVE_LIBGNUTLS 1
# | #define HAVE_GNUTLS_CERTIFICATE_SET_X509_SYSTEM_TRUST 1
# | #define HAVE_LIBNETTLE 1
# | #define HAVE_LIBGMP 1
# | #define HAVE___GMPZ_POWM_SEC 1
# | #define HAVE_GMP_SEC 1
# | #define HAVE_LIBSSH2 1
# | #define HAVE_LIBCARES 1
# | #define HAVE_ARES_ADDR_NODE 1
# | #define HAVE_ARES_SET_SERVERS 1
# | #define USE_LIBNETTLE_MD 1
# | #define ENABLE_SSL 1
# | #define ENABLE_BITTORRENT 1
# | #define ENABLE_METALINK 1
# | #define ENABLE_XML_RPC 1
# | #define ENABLE_ASYNC_DNS 1
# | #define HAVE_ALLOCA_H 1
# | #define HAVE_ALLOCA 1
# | #define STDC_HEADERS 1
# | #define HAVE_ARGZ_H 1
# | #define HAVE_ARPA_INET_H 1
# | #define HAVE_FCNTL_H 1
# | #define HAVE_FLOAT_H 1
# | #define HAVE_INTTYPES_H 1
# | #define HAVE_LANGINFO_H 1
# | #define HAVE_LIBINTL_H 1
# | #define HAVE_LIMITS_H 1
# | #define HAVE_LOCALE_H 1
# | #define HAVE_MALLOC_H 1
# | #define HAVE_NETDB_H 1
# | #define HAVE_NETINET_IN_H 1
# | #define HAVE_NETINET_TCP_H 1
# | #define HAVE_POLL_H 1
# | /* end confdefs.h. */
# | #include
# | #ifdef HAVE_SYS_TYPES_H
# | # include
# | #endif
# | #ifdef HAVE_SYS_STAT_H
# | # include
# | #endif
# | #ifdef STDC_HEADERS
# | # include
# | # include
# | #else
# | # ifdef HAVE_STDLIB_H
# | # include
# | # endif
# | #endif
# | #ifdef HAVE_STRING_H
# | # if !defined STDC_HEADERS && defined HAVE_MEMORY_H
# | # include
# | # endif
# | # include
# | #endif
# | #ifdef HAVE_STRINGS_H
# | # include
# | #endif
# | #ifdef HAVE_INTTYPES_H
# | # include
# | #endif
# | #ifdef HAVE_STDINT_H
# | # include
# | #endif
# | #ifdef HAVE_UNISTD_H
# | # include
# | #endif
# | #include
# configure:21453: result: no
# configure:21453: checking port.h presence
# configure:21453: g++ -E conftest.cpp
# conftest.cpp:71:18: fatal error: port.h: No such file or directory
# #include
# ^
# compilation terminated.
# configure:21453: $? = 1
# configure: failed program was:
# | /* confdefs.h */
# | #define PACKAGE_NAME "aria2"
# | #define PACKAGE_TARNAME "aria2"
# | #define PACKAGE_VERSION "1.24.0"
# | #define PACKAGE_STRING "aria2 1.24.0"
# | #define PACKAGE_BUGREPORT "https://github.com/aria2/aria2/issues"
# | #define PACKAGE_URL "https://aria2.github.io/"
# | #define PACKAGE "aria2"
# | #define VERSION "1.24.0"
# | #define STDC_HEADERS 1
# | #define HAVE_SYS_TYPES_H 1
# | #define HAVE_SYS_STAT_H 1
# | #define HAVE_STDLIB_H 1
# | #define HAVE_STRING_H 1
# | #define HAVE_MEMORY_H 1
# | #define HAVE_STRINGS_H 1
# | #define HAVE_INTTYPES_H 1
# | #define HAVE_STDINT_H 1
# | #define HAVE_UNISTD_H 1
# | #define __EXTENSIONS__ 1
# | #define _ALL_SOURCE 1
# | #define _GNU_SOURCE 1
# | #define _POSIX_PTHREAD_SEMANTICS 1
# | #define _TANDEM_SOURCE 1
# | #define HAVE_DLFCN_H 1
# | #define LT_OBJDIR ".libs/"
# | #define BUILD "x86_64-pc-linux-gnu"
# | #define HOST "x86_64-unknown-linux-gnu"
# | #define TARGET "x86_64-unknown-linux-gnu"
# | #define CA_BUNDLE "/etc/ssl/certs/ca-certificates.crt"
# | #define CXX11_OVERRIDE override
# | #define HAVE_ZLIB 1
# | #define HAVE_GZSETPARAMS 1
# | #define HAVE_LIBXML2 1
# | #define HAVE_SQLITE3 1
# | #define HAVE_SQLITE3_OPEN_V2 1
# | #define HAVE_LIBGNUTLS 1
# | #define HAVE_GNUTLS_CERTIFICATE_SET_X509_SYSTEM_TRUST 1
# | #define HAVE_LIBNETTLE 1
# | #define HAVE_LIBGMP 1
# | #define HAVE___GMPZ_POWM_SEC 1
# | #define HAVE_GMP_SEC 1
# | #define HAVE_LIBSSH2 1
# | #define HAVE_LIBCARES 1
# | #define HAVE_ARES_ADDR_NODE 1
# | #define HAVE_ARES_SET_SERVERS 1
# | #define USE_LIBNETTLE_MD 1
# | #define ENABLE_SSL 1
# | #define ENABLE_BITTORRENT 1
# | #define ENABLE_METALINK 1
# | #define ENABLE_XML_RPC 1
# | #define ENABLE_ASYNC_DNS 1
# | #define HAVE_ALLOCA_H 1
# | #define HAVE_ALLOCA 1
# | #define STDC_HEADERS 1
# | #define HAVE_ARGZ_H 1
# | #define HAVE_ARPA_INET_H 1
# | #define HAVE_FCNTL_H 1
# | #define HAVE_FLOAT_H 1
# | #define HAVE_INTTYPES_H 1
# | #define HAVE_LANGINFO_H 1
# | #define HAVE_LIBINTL_H 1
# | #define HAVE_LIMITS_H 1
# | #define HAVE_LOCALE_H 1
# | #define HAVE_MALLOC_H 1
# | #define HAVE_NETDB_H 1
# | #define HAVE_NETINET_IN_H 1
# | #define HAVE_NETINET_TCP_H 1
# | #define HAVE_POLL_H 1
# | /* end confdefs.h. */
# | #include
# configure:21453: result: no
# configure:21453: checking for port.h
# configure:21453: result: no
# configure:21453: checking signal.h usability
# configure:21453: g++ -c conftest.cpp >&5
# configure:21453: $? = 0
# configure:21453: result: yes
# configure:21453: checking signal.h presence
# configure:21453: g++ -E conftest.cpp
# configure:21453: $? = 0
# configure:21453: result: yes
# configure:21453: checking for signal.h
# configure:21453: result: yes
# configure:21453: checking stddef.h usability
# configure:21453: g++ -c conftest.cpp >&5
# configure:21453: $? = 0
# configure:21453: result: yes
# configure:21453: checking stddef.h presence
# configure:21453: g++ -E conftest.cpp
# configure:21453: $? = 0
# configure:21453: result: yes
# configure:21453: checking for stddef.h
# configure:21453: result: yes
# configure:21453: checking for stdint.h
# configure:21453: result: yes
# configure:21453: checking stdio_ext.h usability
# configure:21453: g++ -c conftest.cpp >&5
# configure:21453: $? = 0
# configure:21453: result: yes
# configure:21453: checking stdio_ext.h presence
# configure:21453: g++ -E conftest.cpp
# configure:21453: $? = 0
# configure:21453: result: yes
# configure:21453: checking for stdio_ext.h
# configure:21453: result: yes
# configure:21453: checking for stdlib.h
# configure:21453: result: yes
# configure:21453: checking for string.h
# configure:21453: result: yes
# configure:21453: checking for strings.h
# configure:21453: result: yes
# configure:21453: checking sys/ioctl.h usability
# configure:21453: g++ -c conftest.cpp >&5
# configure:21453: $? = 0
# configure:21453: result: yes
# configure:21453: checking sys/ioctl.h presence
# configure:21453: g++ -E conftest.cpp
# configure:21453: $? = 0
# configure:21453: result: yes
# configure:21453: checking for sys/ioctl.h
# configure:21453: result: yes
# configure:21453: checking sys/param.h usability
# configure:21453: g++ -c conftest.cpp >&5
# configure:21453: $? = 0
# configure:21453: result: yes
# configure:21453: checking sys/param.h presence
# configure:21453: g++ -E conftest.cpp
# configure:21453: $? = 0
# configure:21453: result: yes
# configure:21453: checking for sys/param.h
# configure:21453: result: yes
# configure:21453: checking sys/resource.h usability
# configure:21453: g++ -c conftest.cpp >&5
# configure:21453: $? = 0
# configure:21453: result: yes
# configure:21453: checking sys/resource.h presence
# configure:21453: g++ -E conftest.cpp
# configure:21453: $? = 0
# configure:21453: result: yes
# configure:21453: checking for sys/resource.h
# configure:21453: result: yes
# configure:21453: checking sys/signal.h usability
# configure:21453: g++ -c conftest.cpp >&5
# configure:21453: $? = 0
# configure:21453: result: yes
# configure:21453: checking sys/signal.h presence
# configure:21453: g++ -E conftest.cpp
# configure:21453: $? = 0
# configure:21453: result: yes
# configure:21453: checking for sys/signal.h
# configure:21453: result: yes
# configure:21453: checking sys/socket.h usability
# configure:21453: g++ -c conftest.cpp >&5
# configure:21453: $? = 0
# configure:21453: result: yes
# configure:21453: checking sys/socket.h presence
# configure:21453: g++ -E conftest.cpp
# configure:21453: $? = 0
# configure:21453: result: yes
# configure:21453: checking for sys/socket.h
# configure:21453: result: yes
# configure:21453: checking sys/time.h usability
# configure:21453: g++ -c conftest.cpp >&5
# configure:21453: $? = 0
# configure:21453: result: yes
# configure:21453: checking sys/time.h presence
# configure:21453: g++ -E conftest.cpp
# configure:21453: $? = 0
# configure:21453: result: yes
# configure:21453: checking for sys/time.h
# configure:21453: result: yes
# configure:21453: checking for sys/types.h
# configure:21453: result: yes
# configure:21453: checking sys/uio.h usability
# configure:21453: g++ -c conftest.cpp >&5
# configure:21453: $? = 0
# configure:21453: result: yes
# configure:21453: checking sys/uio.h presence
# configure:21453: g++ -E conftest.cpp
# configure:21453: $? = 0
# configure:21453: result: yes
# configure:21453: checking for sys/uio.h
# configure:21453: result: yes
# configure:21453: checking sys/utsname.h usability
# configure:21453: g++ -c conftest.cpp >&5
# configure:21453: $? = 0
# configure:21453: result: yes
# configure:21453: checking sys/utsname.h presence
# configure:21453: g++ -E conftest.cpp
# configure:21453: $? = 0
# configure:21453: result: yes
# configure:21453: checking for sys/utsname.h
# configure:21453: result: yes
# configure:21453: checking termios.h usability
# configure:21453: g++ -c conftest.cpp >&5
# configure:21453: $? = 0
# configure:21453: result: yes
# configure:21453: checking termios.h presence
# configure:21453: g++ -E conftest.cpp
# configure:21453: $? = 0
# configure:21453: result: yes
# configure:21453: checking for termios.h
# configure:21453: result: yes
# configure:21453: checking for unistd.h
# configure:21453: result: yes
# configure:21453: checking utime.h usability
# configure:21453: g++ -c conftest.cpp >&5
# configure:21453: $? = 0
# configure:21453: result: yes
# configure:21453: checking utime.h presence
# configure:21453: g++ -E conftest.cpp
# configure:21453: $? = 0
# configure:21453: result: yes
# configure:21453: checking for utime.h
# configure:21453: result: yes
# configure:21453: checking wchar.h usability
# configure:21453: g++ -c conftest.cpp >&5
# configure:21453: $? = 0
# configure:21453: result: yes
# configure:21453: checking wchar.h presence
# configure:21453: g++ -E conftest.cpp
# configure:21453: $? = 0
# configure:21453: result: yes
# configure:21453: checking for wchar.h
# configure:21453: result: yes
# configure:21453: checking ifaddrs.h usability
# configure:21453: g++ -c conftest.cpp >&5
# configure:21453: $? = 0
# configure:21453: result: yes
# configure:21453: checking ifaddrs.h presence
# configure:21453: g++ -E conftest.cpp
# configure:21453: $? = 0
# configure:21453: result: yes
# configure:21453: checking for ifaddrs.h
# configure:21453: result: yes
# configure:21453: checking pwd.h usability
# configure:21453: g++ -c conftest.cpp >&5
# configure:21453: $? = 0
# configure:21453: result: yes
# configure:21453: checking pwd.h presence
# configure:21453: g++ -E conftest.cpp
# configure:21453: $? = 0
# configure:21453: result: yes
# configure:21453: checking for pwd.h
# configure:21453: result: yes
# configure:21465: checking for stdbool.h that conforms to C99
# configure:21532: g++ -c conftest.cpp >&5
# conftest.cpp:96:15: error: expected unqualified-id before string constant
# "error: bool is not defined"
# ^~~~~~~~~~~~~~~~~~~~~~~~~~~~
# conftest.cpp:114:48: error: 's' does not name a type
# struct s { _Bool s: 1; _Bool t; } s;
# ^
# conftest.cpp:124:28: error: 's' was not declared in this scope
# char i[sizeof s.t];
# ^
# conftest.cpp: In function 'int main()':
# conftest.cpp:142:24: error: 's' was not declared in this scope
# bool e = &s;
# ^
# conftest.cpp:146:63: error: 'i' was not declared in this scope
# return (!a + !b + !c + !d + !e + !f + !g + !h + !i + !!j + !k + !!l
# ^
# configure:21532: $? = 1
# configure: failed program was:
# | /* confdefs.h */
# | #define PACKAGE_NAME "aria2"
# | #define PACKAGE_TARNAME "aria2"
# | #define PACKAGE_VERSION "1.24.0"
# | #define PACKAGE_STRING "aria2 1.24.0"
# | #define PACKAGE_BUGREPORT "https://github.com/aria2/aria2/issues"
# | #define PACKAGE_URL "https://aria2.github.io/"
# | #define PACKAGE "aria2"
# | #define VERSION "1.24.0"
# | #define STDC_HEADERS 1
# | #define HAVE_SYS_TYPES_H 1
# | #define HAVE_SYS_STAT_H 1
# | #define HAVE_STDLIB_H 1
# | #define HAVE_STRING_H 1
# | #define HAVE_MEMORY_H 1
# | #define HAVE_STRINGS_H 1
# | #define HAVE_INTTYPES_H 1
# | #define HAVE_STDINT_H 1
# | #define HAVE_UNISTD_H 1
# | #define __EXTENSIONS__ 1
# | #define _ALL_SOURCE 1
# | #define _GNU_SOURCE 1
# | #define _POSIX_PTHREAD_SEMANTICS 1
# | #define _TANDEM_SOURCE 1
# | #define HAVE_DLFCN_H 1
# | #define LT_OBJDIR ".libs/"
# | #define BUILD "x86_64-pc-linux-gnu"
# | #define HOST "x86_64-unknown-linux-gnu"
# | #define TARGET "x86_64-unknown-linux-gnu"
# | #define CA_BUNDLE "/etc/ssl/certs/ca-certificates.crt"
# | #define CXX11_OVERRIDE override
# | #define HAVE_ZLIB 1
# | #define HAVE_GZSETPARAMS 1
# | #define HAVE_LIBXML2 1
# | #define HAVE_SQLITE3 1
# | #define HAVE_SQLITE3_OPEN_V2 1
# | #define HAVE_LIBGNUTLS 1
# | #define HAVE_GNUTLS_CERTIFICATE_SET_X509_SYSTEM_TRUST 1
# | #define HAVE_LIBNETTLE 1
# | #define HAVE_LIBGMP 1
# | #define HAVE___GMPZ_POWM_SEC 1
# | #define HAVE_GMP_SEC 1
# | #define HAVE_LIBSSH2 1
# | #define HAVE_LIBCARES 1
# | #define HAVE_ARES_ADDR_NODE 1
# | #define HAVE_ARES_SET_SERVERS 1
# | #define USE_LIBNETTLE_MD 1
# | #define ENABLE_SSL 1
# | #define ENABLE_BITTORRENT 1
# | #define ENABLE_METALINK 1
# | #define ENABLE_XML_RPC 1
# | #define ENABLE_ASYNC_DNS 1
# | #define HAVE_ALLOCA_H 1
# | #define HAVE_ALLOCA 1
# | #define STDC_HEADERS 1
# | #define HAVE_ARGZ_H 1
# | #define HAVE_ARPA_INET_H 1
# | #define HAVE_FCNTL_H 1
# | #define HAVE_FLOAT_H 1
# | #define HAVE_INTTYPES_H 1
# | #define HAVE_LANGINFO_H 1
# | #define HAVE_LIBINTL_H 1
# | #define HAVE_LIMITS_H 1
# | #define HAVE_LOCALE_H 1
# | #define HAVE_MALLOC_H 1
# | #define HAVE_NETDB_H 1
# | #define HAVE_NETINET_IN_H 1
# | #define HAVE_NETINET_TCP_H 1
# | #define HAVE_POLL_H 1
# | #define HAVE_SIGNAL_H 1
# | #define HAVE_STDDEF_H 1
# | #define HAVE_STDINT_H 1
# | #define HAVE_STDIO_EXT_H 1
# | #define HAVE_STDLIB_H 1
# | #define HAVE_STRING_H 1
# | #define HAVE_STRINGS_H 1
# | #define HAVE_SYS_IOCTL_H 1
# | #define HAVE_SYS_PARAM_H 1
# | #define HAVE_SYS_RESOURCE_H 1
# | #define HAVE_SYS_SIGNAL_H 1
# | #define HAVE_SYS_SOCKET_H 1
# | #define HAVE_SYS_TIME_H 1
# | #define HAVE_SYS_TYPES_H 1
# | #define HAVE_SYS_UIO_H 1
# | #define HAVE_SYS_UTSNAME_H 1
# | #define HAVE_TERMIOS_H 1
# | #define HAVE_UNISTD_H 1
# | #define HAVE_UTIME_H 1
# | #define HAVE_WCHAR_H 1
# | #define HAVE_IFADDRS_H 1
# | #define HAVE_PWD_H 1
# | /* end confdefs.h. */
# |
# | #include
# | #ifndef bool
# | "error: bool is not defined"
# | #endif
# | #ifndef false
# | "error: false is not defined"
# | #endif
# | #if false
# | "error: false is not 0"
# | #endif
# | #ifndef true
# | "error: true is not defined"
# | #endif
# | #if true != 1
# | "error: true is not 1"
# | #endif
# | #ifndef __bool_true_false_are_defined
# | "error: __bool_true_false_are_defined is not defined"
# | #endif
# |
# | struct s { _Bool s: 1; _Bool t; } s;
# |
# | char a[true == 1 ? 1 : -1];
# | char b[false == 0 ? 1 : -1];
# | char c[__bool_true_false_are_defined == 1 ? 1 : -1];
# | char d[(bool) 0.5 == true ? 1 : -1];
# | /* See body of main program for 'e'. */
# | char f[(_Bool) 0.0 == false ? 1 : -1];
# | char g[true];
# | char h[sizeof (_Bool)];
# | char i[sizeof s.t];
# | enum { j = false, k = true, l = false * true, m = true * 256 };
# | /* The following fails for
# | HP aC++/ANSI C B3910B A.05.55 [Dec 04 2003]. */
# | _Bool n[m];
# | char o[sizeof n == m * sizeof n[0] ? 1 : -1];
# | char p[-1 - (_Bool) 0 < 0 && -1 - (bool) 0 < 0 ? 1 : -1];
# | /* Catch a bug in an HP-UX C compiler. See
# | http://gcc.gnu.org/ml/gcc-patches/2003-12/msg02303.html
# | http://lists.gnu.org/archive/html/bug-coreutils/2005-11/msg00161.html
# | */
# | _Bool q = true;
# | _Bool *pq = &q;
# |
# | int
# | main ()
# | {
# |
# | bool e = &s;
# | *pq |= q;
# | *pq |= ! q;
# | /* Refer to every declared value, to avoid compiler optimizations. */
# | return (!a + !b + !c + !d + !e + !f + !g + !h + !i + !!j + !k + !!l
# | + !m + !n + !o + !p + !q + !pq);
# |
# | ;
# | return 0;
# | }
# configure:21539: result: no
# configure:21541: checking for _Bool
# configure:21541: g++ -c conftest.cpp >&5
# conftest.cpp: In function 'int main()':
# conftest.cpp:129:13: error: '_Bool' was not declared in this scope
# if (sizeof (_Bool))
# ^~~~~
# configure:21541: $? = 1
# configure: failed program was:
# | /* confdefs.h */
# | #define PACKAGE_NAME "aria2"
# | #define PACKAGE_TARNAME "aria2"
# | #define PACKAGE_VERSION "1.24.0"
# | #define PACKAGE_STRING "aria2 1.24.0"
# | #define PACKAGE_BUGREPORT "https://github.com/aria2/aria2/issues"
# | #define PACKAGE_URL "https://aria2.github.io/"
# | #define PACKAGE "aria2"
# | #define VERSION "1.24.0"
# | #define STDC_HEADERS 1
# | #define HAVE_SYS_TYPES_H 1
# | #define HAVE_SYS_STAT_H 1
# | #define HAVE_STDLIB_H 1
# | #define HAVE_STRING_H 1
# | #define HAVE_MEMORY_H 1
# | #define HAVE_STRINGS_H 1
# | #define HAVE_INTTYPES_H 1
# | #define HAVE_STDINT_H 1
# | #define HAVE_UNISTD_H 1
# | #define __EXTENSIONS__ 1
# | #define _ALL_SOURCE 1
# | #define _GNU_SOURCE 1
# | #define _POSIX_PTHREAD_SEMANTICS 1
# | #define _TANDEM_SOURCE 1
# | #define HAVE_DLFCN_H 1
# | #define LT_OBJDIR ".libs/"
# | #define BUILD "x86_64-pc-linux-gnu"
# | #define HOST "x86_64-unknown-linux-gnu"
# | #define TARGET "x86_64-unknown-linux-gnu"
# | #define CA_BUNDLE "/etc/ssl/certs/ca-certificates.crt"
# | #define CXX11_OVERRIDE override
# | #define HAVE_ZLIB 1
# | #define HAVE_GZSETPARAMS 1
# | #define HAVE_LIBXML2 1
# | #define HAVE_SQLITE3 1
# | #define HAVE_SQLITE3_OPEN_V2 1
# | #define HAVE_LIBGNUTLS 1
# | #define HAVE_GNUTLS_CERTIFICATE_SET_X509_SYSTEM_TRUST 1
# | #define HAVE_LIBNETTLE 1
# | #define HAVE_LIBGMP 1
# | #define HAVE___GMPZ_POWM_SEC 1
# | #define HAVE_GMP_SEC 1
# | #define HAVE_LIBSSH2 1
# | #define HAVE_LIBCARES 1
# | #define HAVE_ARES_ADDR_NODE 1
# | #define HAVE_ARES_SET_SERVERS 1
# | #define USE_LIBNETTLE_MD 1
# | #define ENABLE_SSL 1
# | #define ENABLE_BITTORRENT 1
# | #define ENABLE_METALINK 1
# | #define ENABLE_XML_RPC 1
# | #define ENABLE_ASYNC_DNS 1
# | #define HAVE_ALLOCA_H 1
# | #define HAVE_ALLOCA 1
# | #define STDC_HEADERS 1
# | #define HAVE_ARGZ_H 1
# | #define HAVE_ARPA_INET_H 1
# | #define HAVE_FCNTL_H 1
# | #define HAVE_FLOAT_H 1
# | #define HAVE_INTTYPES_H 1
# | #define HAVE_LANGINFO_H 1
# | #define HAVE_LIBINTL_H 1
# | #define HAVE_LIMITS_H 1
# | #define HAVE_LOCALE_H 1
# | #define HAVE_MALLOC_H 1
# | #define HAVE_NETDB_H 1
# | #define HAVE_NETINET_IN_H 1
# | #define HAVE_NETINET_TCP_H 1
# | #define HAVE_POLL_H 1
# | #define HAVE_SIGNAL_H 1
# | #define HAVE_STDDEF_H 1
# | #define HAVE_STDINT_H 1
# | #define HAVE_STDIO_EXT_H 1
# | #define HAVE_STDLIB_H 1
# | #define HAVE_STRING_H 1
# | #define HAVE_STRINGS_H 1
# | #define HAVE_SYS_IOCTL_H 1
# | #define HAVE_SYS_PARAM_H 1
# | #define HAVE_SYS_RESOURCE_H 1
# | #define HAVE_SYS_SIGNAL_H 1
# | #define HAVE_SYS_SOCKET_H 1
# | #define HAVE_SYS_TIME_H 1
# | #define HAVE_SYS_TYPES_H 1
# | #define HAVE_SYS_UIO_H 1
# | #define HAVE_SYS_UTSNAME_H 1
# | #define HAVE_TERMIOS_H 1
# | #define HAVE_UNISTD_H 1
# | #define HAVE_UTIME_H 1
# | #define HAVE_WCHAR_H 1
# | #define HAVE_IFADDRS_H 1
# | #define HAVE_PWD_H 1
# | /* end confdefs.h. */
# | #include
# | #ifdef HAVE_SYS_TYPES_H
# | # include
# | #endif
# | #ifdef HAVE_SYS_STAT_H
# | # include
# | #endif
# | #ifdef STDC_HEADERS
# | # include
# | # include
# | #else
# | # ifdef HAVE_STDLIB_H
# | # include
# | # endif
# | #endif
# | #ifdef HAVE_STRING_H
# | # if !defined STDC_HEADERS && defined HAVE_MEMORY_H
# | # include
# | # endif
# | # include
# | #endif
# | #ifdef HAVE_STRINGS_H
# | # include
# | #endif
# | #ifdef HAVE_INTTYPES_H
# | # include
# | #endif
# | #ifdef HAVE_STDINT_H
# | # include
# | #endif
# | #ifdef HAVE_UNISTD_H
# | # include
# | #endif
# | int
# | main ()
# | {
# | if (sizeof (_Bool))
# | return 0;
# | ;
# | return 0;
# | }
# configure:21541: result: no
# configure:21558: checking for an ANSI C-conforming const
# configure:21624: g++ -c conftest.cpp >&5
# configure:21624: $? = 0
# configure:21631: result: yes
# configure:21639: checking for inline
# configure:21655: g++ -c conftest.cpp >&5
# configure:21655: $? = 0
# configure:21663: result: inline
# configure:21681: checking for int16_t
# configure:21681: g++ -c conftest.cpp >&5
# configure:21681: $? = 0
# configure:21681: g++ -c conftest.cpp >&5
# conftest.cpp: In function 'int main()':
# conftest.cpp:131:58: error: size of array 'test_array' is negative
# < (int16_t) (((((int16_t) 1 << N) << N) - 1) * 2 + 2))];
# ^
# configure:21681: $? = 1
# configure: failed program was:
# | /* confdefs.h */
# | #define PACKAGE_NAME "aria2"
# | #define PACKAGE_TARNAME "aria2"
# | #define PACKAGE_VERSION "1.24.0"
# | #define PACKAGE_STRING "aria2 1.24.0"
# | #define PACKAGE_BUGREPORT "https://github.com/aria2/aria2/issues"
# | #define PACKAGE_URL "https://aria2.github.io/"
# | #define PACKAGE "aria2"
# | #define VERSION "1.24.0"
# | #define STDC_HEADERS 1
# | #define HAVE_SYS_TYPES_H 1
# | #define HAVE_SYS_STAT_H 1
# | #define HAVE_STDLIB_H 1
# | #define HAVE_STRING_H 1
# | #define HAVE_MEMORY_H 1
# | #define HAVE_STRINGS_H 1
# | #define HAVE_INTTYPES_H 1
# | #define HAVE_STDINT_H 1
# | #define HAVE_UNISTD_H 1
# | #define __EXTENSIONS__ 1
# | #define _ALL_SOURCE 1
# | #define _GNU_SOURCE 1
# | #define _POSIX_PTHREAD_SEMANTICS 1
# | #define _TANDEM_SOURCE 1
# | #define HAVE_DLFCN_H 1
# | #define LT_OBJDIR ".libs/"
# | #define BUILD "x86_64-pc-linux-gnu"
# | #define HOST "x86_64-unknown-linux-gnu"
# | #define TARGET "x86_64-unknown-linux-gnu"
# | #define CA_BUNDLE "/etc/ssl/certs/ca-certificates.crt"
# | #define CXX11_OVERRIDE override
# | #define HAVE_ZLIB 1
# | #define HAVE_GZSETPARAMS 1
# | #define HAVE_LIBXML2 1
# | #define HAVE_SQLITE3 1
# | #define HAVE_SQLITE3_OPEN_V2 1
# | #define HAVE_LIBGNUTLS 1
# | #define HAVE_GNUTLS_CERTIFICATE_SET_X509_SYSTEM_TRUST 1
# | #define HAVE_LIBNETTLE 1
# | #define HAVE_LIBGMP 1
# | #define HAVE___GMPZ_POWM_SEC 1
# | #define HAVE_GMP_SEC 1
# | #define HAVE_LIBSSH2 1
# | #define HAVE_LIBCARES 1
# | #define HAVE_ARES_ADDR_NODE 1
# | #define HAVE_ARES_SET_SERVERS 1
# | #define USE_LIBNETTLE_MD 1
# | #define ENABLE_SSL 1
# | #define ENABLE_BITTORRENT 1
# | #define ENABLE_METALINK 1
# | #define ENABLE_XML_RPC 1
# | #define ENABLE_ASYNC_DNS 1
# | #define HAVE_ALLOCA_H 1
# | #define HAVE_ALLOCA 1
# | #define STDC_HEADERS 1
# | #define HAVE_ARGZ_H 1
# | #define HAVE_ARPA_INET_H 1
# | #define HAVE_FCNTL_H 1
# | #define HAVE_FLOAT_H 1
# | #define HAVE_INTTYPES_H 1
# | #define HAVE_LANGINFO_H 1
# | #define HAVE_LIBINTL_H 1
# | #define HAVE_LIMITS_H 1
# | #define HAVE_LOCALE_H 1
# | #define HAVE_MALLOC_H 1
# | #define HAVE_NETDB_H 1
# | #define HAVE_NETINET_IN_H 1
# | #define HAVE_NETINET_TCP_H 1
# | #define HAVE_POLL_H 1
# | #define HAVE_SIGNAL_H 1
# | #define HAVE_STDDEF_H 1
# | #define HAVE_STDINT_H 1
# | #define HAVE_STDIO_EXT_H 1
# | #define HAVE_STDLIB_H 1
# | #define HAVE_STRING_H 1
# | #define HAVE_STRINGS_H 1
# | #define HAVE_SYS_IOCTL_H 1
# | #define HAVE_SYS_PARAM_H 1
# | #define HAVE_SYS_RESOURCE_H 1
# | #define HAVE_SYS_SIGNAL_H 1
# | #define HAVE_SYS_SOCKET_H 1
# | #define HAVE_SYS_TIME_H 1
# | #define HAVE_SYS_TYPES_H 1
# | #define HAVE_SYS_UIO_H 1
# | #define HAVE_SYS_UTSNAME_H 1
# | #define HAVE_TERMIOS_H 1
# | #define HAVE_UNISTD_H 1
# | #define HAVE_UTIME_H 1
# | #define HAVE_WCHAR_H 1
# | #define HAVE_IFADDRS_H 1
# | #define HAVE_PWD_H 1
# | /* end confdefs.h. */
# | #include
# | #ifdef HAVE_SYS_TYPES_H
# | # include
# | #endif
# | #ifdef HAVE_SYS_STAT_H
# | # include
# | #endif
# | #ifdef STDC_HEADERS
# | # include
# | # include
# | #else
# | # ifdef HAVE_STDLIB_H
# | # include
# | # endif
# | #endif
# | #ifdef HAVE_STRING_H
# | # if !defined STDC_HEADERS && defined HAVE_MEMORY_H
# | # include
# | # endif
# | # include
# | #endif
# | #ifdef HAVE_STRINGS_H
# | # include
# | #endif
# | #ifdef HAVE_INTTYPES_H
# | # include
# | #endif
# | #ifdef HAVE_STDINT_H
# | # include
# | #endif
# | #ifdef HAVE_UNISTD_H
# | # include
# | #endif
# | enum { N = 16 / 2 - 1 };
# | int
# | main ()
# | {
# | static int test_array [1 - 2 * !((int16_t) (((((int16_t) 1 << N) << N) - 1) * 2 + 1)
# | < (int16_t) (((((int16_t) 1 << N) << N) - 1) * 2 + 2))];
# | test_array [0] = 0;
# | return test_array [0];
# |
# | ;
# | return 0;
# | }
# configure:21681: result: yes
# configure:21692: checking for int32_t
# configure:21692: g++ -c conftest.cpp >&5
# configure:21692: $? = 0
# configure:21692: g++ -c conftest.cpp >&5
# conftest.cpp: In function 'int main()':
# conftest.cpp:131:53: warning: integer overflow in expression [-Woverflow]
# < (int32_t) (((((int32_t) 1 << N) << N) - 1) * 2 + 2))];
# ~~~~~~~~~~~~~~~~~~~~~~~~~~~~~~~~~~~~^~~
# conftest.cpp:131:58: error: size of array 'test_array' is negative
# < (int32_t) (((((int32_t) 1 << N) << N) - 1) * 2 + 2))];
# ^
# configure:21692: $? = 1
# configure: failed program was:
# | /* confdefs.h */
# | #define PACKAGE_NAME "aria2"
# | #define PACKAGE_TARNAME "aria2"
# | #define PACKAGE_VERSION "1.24.0"
# | #define PACKAGE_STRING "aria2 1.24.0"
# | #define PACKAGE_BUGREPORT "https://github.com/aria2/aria2/issues"
# | #define PACKAGE_URL "https://aria2.github.io/"
# | #define PACKAGE "aria2"
# | #define VERSION "1.24.0"
# | #define STDC_HEADERS 1
# | #define HAVE_SYS_TYPES_H 1
# | #define HAVE_SYS_STAT_H 1
# | #define HAVE_STDLIB_H 1
# | #define HAVE_STRING_H 1
# | #define HAVE_MEMORY_H 1
# | #define HAVE_STRINGS_H 1
# | #define HAVE_INTTYPES_H 1
# | #define HAVE_STDINT_H 1
# | #define HAVE_UNISTD_H 1
# | #define __EXTENSIONS__ 1
# | #define _ALL_SOURCE 1
# | #define _GNU_SOURCE 1
# | #define _POSIX_PTHREAD_SEMANTICS 1
# | #define _TANDEM_SOURCE 1
# | #define HAVE_DLFCN_H 1
# | #define LT_OBJDIR ".libs/"
# | #define BUILD "x86_64-pc-linux-gnu"
# | #define HOST "x86_64-unknown-linux-gnu"
# | #define TARGET "x86_64-unknown-linux-gnu"
# | #define CA_BUNDLE "/etc/ssl/certs/ca-certificates.crt"
# | #define CXX11_OVERRIDE override
# | #define HAVE_ZLIB 1
# | #define HAVE_GZSETPARAMS 1
# | #define HAVE_LIBXML2 1
# | #define HAVE_SQLITE3 1
# | #define HAVE_SQLITE3_OPEN_V2 1
# | #define HAVE_LIBGNUTLS 1
# | #define HAVE_GNUTLS_CERTIFICATE_SET_X509_SYSTEM_TRUST 1
# | #define HAVE_LIBNETTLE 1
# | #define HAVE_LIBGMP 1
# | #define HAVE___GMPZ_POWM_SEC 1
# | #define HAVE_GMP_SEC 1
# | #define HAVE_LIBSSH2 1
# | #define HAVE_LIBCARES 1
# | #define HAVE_ARES_ADDR_NODE 1
# | #define HAVE_ARES_SET_SERVERS 1
# | #define USE_LIBNETTLE_MD 1
# | #define ENABLE_SSL 1
# | #define ENABLE_BITTORRENT 1
# | #define ENABLE_METALINK 1
# | #define ENABLE_XML_RPC 1
# | #define ENABLE_ASYNC_DNS 1
# | #define HAVE_ALLOCA_H 1
# | #define HAVE_ALLOCA 1
# | #define STDC_HEADERS 1
# | #define HAVE_ARGZ_H 1
# | #define HAVE_ARPA_INET_H 1
# | #define HAVE_FCNTL_H 1
# | #define HAVE_FLOAT_H 1
# | #define HAVE_INTTYPES_H 1
# | #define HAVE_LANGINFO_H 1
# | #define HAVE_LIBINTL_H 1
# | #define HAVE_LIMITS_H 1
# | #define HAVE_LOCALE_H 1
# | #define HAVE_MALLOC_H 1
# | #define HAVE_NETDB_H 1
# | #define HAVE_NETINET_IN_H 1
# | #define HAVE_NETINET_TCP_H 1
# | #define HAVE_POLL_H 1
# | #define HAVE_SIGNAL_H 1
# | #define HAVE_STDDEF_H 1
# | #define HAVE_STDINT_H 1
# | #define HAVE_STDIO_EXT_H 1
# | #define HAVE_STDLIB_H 1
# | #define HAVE_STRING_H 1
# | #define HAVE_STRINGS_H 1
# | #define HAVE_SYS_IOCTL_H 1
# | #define HAVE_SYS_PARAM_H 1
# | #define HAVE_SYS_RESOURCE_H 1
# | #define HAVE_SYS_SIGNAL_H 1
# | #define HAVE_SYS_SOCKET_H 1
# | #define HAVE_SYS_TIME_H 1
# | #define HAVE_SYS_TYPES_H 1
# | #define HAVE_SYS_UIO_H 1
# | #define HAVE_SYS_UTSNAME_H 1
# | #define HAVE_TERMIOS_H 1
# | #define HAVE_UNISTD_H 1
# | #define HAVE_UTIME_H 1
# | #define HAVE_WCHAR_H 1
# | #define HAVE_IFADDRS_H 1
# | #define HAVE_PWD_H 1
# | /* end confdefs.h. */
# | #include
# | #ifdef HAVE_SYS_TYPES_H
# | # include
# | #endif
# | #ifdef HAVE_SYS_STAT_H
# | # include
# | #endif
# | #ifdef STDC_HEADERS
# | # include
# | # include
# | #else
# | # ifdef HAVE_STDLIB_H
# | # include
# | # endif
# | #endif
# | #ifdef HAVE_STRING_H
# | # if !defined STDC_HEADERS && defined HAVE_MEMORY_H
# | # include
# | # endif
# | # include
# | #endif
# | #ifdef HAVE_STRINGS_H
# | # include
# | #endif
# | #ifdef HAVE_INTTYPES_H
# | # include
# | #endif
# | #ifdef HAVE_STDINT_H
# | # include
# | #endif
# | #ifdef HAVE_UNISTD_H
# | # include
# | #endif
# | enum { N = 32 / 2 - 1 };
# | int
# | main ()
# | {
# | static int test_array [1 - 2 * !((int32_t) (((((int32_t) 1 << N) << N) - 1) * 2 + 1)
# | < (int32_t) (((((int32_t) 1 << N) << N) - 1) * 2 + 2))];
# | test_array [0] = 0;
# | return test_array [0];
# |
# | ;
# | return 0;
# | }
# configure:21692: result: yes
# configure:21703: checking for int64_t
# configure:21703: g++ -c conftest.cpp >&5
# configure:21703: $? = 0
# configure:21703: g++ -c conftest.cpp >&5
# conftest.cpp: In function 'int main()':
# conftest.cpp:131:53: warning: integer overflow in expression [-Woverflow]
# < (int64_t) (((((int64_t) 1 << N) << N) - 1) * 2 + 2))];
# ~~~~~~~~~~~~~~~~~~~~~~~~~~~~~~~~~~~~^~~
# conftest.cpp:131:58: error: size of array 'test_array' is negative
# < (int64_t) (((((int64_t) 1 << N) << N) - 1) * 2 + 2))];
# ^
# configure:21703: $? = 1
# configure: failed program was:
# | /* confdefs.h */
# | #define PACKAGE_NAME "aria2"
# | #define PACKAGE_TARNAME "aria2"
# | #define PACKAGE_VERSION "1.24.0"
# | #define PACKAGE_STRING "aria2 1.24.0"
# | #define PACKAGE_BUGREPORT "https://github.com/aria2/aria2/issues"
# | #define PACKAGE_URL "https://aria2.github.io/"
# | #define PACKAGE "aria2"
# | #define VERSION "1.24.0"
# | #define STDC_HEADERS 1
# | #define HAVE_SYS_TYPES_H 1
# | #define HAVE_SYS_STAT_H 1
# | #define HAVE_STDLIB_H 1
# | #define HAVE_STRING_H 1
# | #define HAVE_MEMORY_H 1
# | #define HAVE_STRINGS_H 1
# | #define HAVE_INTTYPES_H 1
# | #define HAVE_STDINT_H 1
# | #define HAVE_UNISTD_H 1
# | #define __EXTENSIONS__ 1
# | #define _ALL_SOURCE 1
# | #define _GNU_SOURCE 1
# | #define _POSIX_PTHREAD_SEMANTICS 1
# | #define _TANDEM_SOURCE 1
# | #define HAVE_DLFCN_H 1
# | #define LT_OBJDIR ".libs/"
# | #define BUILD "x86_64-pc-linux-gnu"
# | #define HOST "x86_64-unknown-linux-gnu"
# | #define TARGET "x86_64-unknown-linux-gnu"
# | #define CA_BUNDLE "/etc/ssl/certs/ca-certificates.crt"
# | #define CXX11_OVERRIDE override
# | #define HAVE_ZLIB 1
# | #define HAVE_GZSETPARAMS 1
# | #define HAVE_LIBXML2 1
# | #define HAVE_SQLITE3 1
# | #define HAVE_SQLITE3_OPEN_V2 1
# | #define HAVE_LIBGNUTLS 1
# | #define HAVE_GNUTLS_CERTIFICATE_SET_X509_SYSTEM_TRUST 1
# | #define HAVE_LIBNETTLE 1
# | #define HAVE_LIBGMP 1
# | #define HAVE___GMPZ_POWM_SEC 1
# | #define HAVE_GMP_SEC 1
# | #define HAVE_LIBSSH2 1
# | #define HAVE_LIBCARES 1
# | #define HAVE_ARES_ADDR_NODE 1
# | #define HAVE_ARES_SET_SERVERS 1
# | #define USE_LIBNETTLE_MD 1
# | #define ENABLE_SSL 1
# | #define ENABLE_BITTORRENT 1
# | #define ENABLE_METALINK 1
# | #define ENABLE_XML_RPC 1
# | #define ENABLE_ASYNC_DNS 1
# | #define HAVE_ALLOCA_H 1
# | #define HAVE_ALLOCA 1
# | #define STDC_HEADERS 1
# | #define HAVE_ARGZ_H 1
# | #define HAVE_ARPA_INET_H 1
# | #define HAVE_FCNTL_H 1
# | #define HAVE_FLOAT_H 1
# | #define HAVE_INTTYPES_H 1
# | #define HAVE_LANGINFO_H 1
# | #define HAVE_LIBINTL_H 1
# | #define HAVE_LIMITS_H 1
# | #define HAVE_LOCALE_H 1
# | #define HAVE_MALLOC_H 1
# | #define HAVE_NETDB_H 1
# | #define HAVE_NETINET_IN_H 1
# | #define HAVE_NETINET_TCP_H 1
# | #define HAVE_POLL_H 1
# | #define HAVE_SIGNAL_H 1
# | #define HAVE_STDDEF_H 1
# | #define HAVE_STDINT_H 1
# | #define HAVE_STDIO_EXT_H 1
# | #define HAVE_STDLIB_H 1
# | #define HAVE_STRING_H 1
# | #define HAVE_STRINGS_H 1
# | #define HAVE_SYS_IOCTL_H 1
# | #define HAVE_SYS_PARAM_H 1
# | #define HAVE_SYS_RESOURCE_H 1
# | #define HAVE_SYS_SIGNAL_H 1
# | #define HAVE_SYS_SOCKET_H 1
# | #define HAVE_SYS_TIME_H 1
# | #define HAVE_SYS_TYPES_H 1
# | #define HAVE_SYS_UIO_H 1
# | #define HAVE_SYS_UTSNAME_H 1
# | #define HAVE_TERMIOS_H 1
# | #define HAVE_UNISTD_H 1
# | #define HAVE_UTIME_H 1
# | #define HAVE_WCHAR_H 1
# | #define HAVE_IFADDRS_H 1
# | #define HAVE_PWD_H 1
# | /* end confdefs.h. */
# | #include
# | #ifdef HAVE_SYS_TYPES_H
# | # include
# | #endif
# | #ifdef HAVE_SYS_STAT_H
# | # include
# | #endif
# | #ifdef STDC_HEADERS
# | # include
# | # include
# | #else
# | # ifdef HAVE_STDLIB_H
# | # include
# | # endif
# | #endif
# | #ifdef HAVE_STRING_H
# | # if !defined STDC_HEADERS && defined HAVE_MEMORY_H
# | # include
# | # endif
# | # include
# | #endif
# | #ifdef HAVE_STRINGS_H
# | # include
# | #endif
# | #ifdef HAVE_INTTYPES_H
# | # include
# | #endif
# | #ifdef HAVE_STDINT_H
# | # include
# | #endif
# | #ifdef HAVE_UNISTD_H
# | # include
# | #endif
# | enum { N = 64 / 2 - 1 };
# | int
# | main ()
# | {
# | static int test_array [1 - 2 * !((int64_t) (((((int64_t) 1 << N) << N) - 1) * 2 + 1)
# | < (int64_t) (((((int64_t) 1 << N) << N) - 1) * 2 + 2))];
# | test_array [0] = 0;
# | return test_array [0];
# |
# | ;
# | return 0;
# | }
# configure:21703: result: yes
# configure:21714: checking for int8_t
# configure:21714: g++ -c conftest.cpp >&5
# configure:21714: $? = 0
# configure:21714: g++ -c conftest.cpp >&5
# conftest.cpp: In function 'int main()':
# conftest.cpp:131:56: error: size of array 'test_array' is negative
# < (int8_t) (((((int8_t) 1 << N) << N) - 1) * 2 + 2))];
# ^
# configure:21714: $? = 1
# configure: failed program was:
# | /* confdefs.h */
# | #define PACKAGE_NAME "aria2"
# | #define PACKAGE_TARNAME "aria2"
# | #define PACKAGE_VERSION "1.24.0"
# | #define PACKAGE_STRING "aria2 1.24.0"
# | #define PACKAGE_BUGREPORT "https://github.com/aria2/aria2/issues"
# | #define PACKAGE_URL "https://aria2.github.io/"
# | #define PACKAGE "aria2"
# | #define VERSION "1.24.0"
# | #define STDC_HEADERS 1
# | #define HAVE_SYS_TYPES_H 1
# | #define HAVE_SYS_STAT_H 1
# | #define HAVE_STDLIB_H 1
# | #define HAVE_STRING_H 1
# | #define HAVE_MEMORY_H 1
# | #define HAVE_STRINGS_H 1
# | #define HAVE_INTTYPES_H 1
# | #define HAVE_STDINT_H 1
# | #define HAVE_UNISTD_H 1
# | #define __EXTENSIONS__ 1
# | #define _ALL_SOURCE 1
# | #define _GNU_SOURCE 1
# | #define _POSIX_PTHREAD_SEMANTICS 1
# | #define _TANDEM_SOURCE 1
# | #define HAVE_DLFCN_H 1
# | #define LT_OBJDIR ".libs/"
# | #define BUILD "x86_64-pc-linux-gnu"
# | #define HOST "x86_64-unknown-linux-gnu"
# | #define TARGET "x86_64-unknown-linux-gnu"
# | #define CA_BUNDLE "/etc/ssl/certs/ca-certificates.crt"
# | #define CXX11_OVERRIDE override
# | #define HAVE_ZLIB 1
# | #define HAVE_GZSETPARAMS 1
# | #define HAVE_LIBXML2 1
# | #define HAVE_SQLITE3 1
# | #define HAVE_SQLITE3_OPEN_V2 1
# | #define HAVE_LIBGNUTLS 1
# | #define HAVE_GNUTLS_CERTIFICATE_SET_X509_SYSTEM_TRUST 1
# | #define HAVE_LIBNETTLE 1
# | #define HAVE_LIBGMP 1
# | #define HAVE___GMPZ_POWM_SEC 1
# | #define HAVE_GMP_SEC 1
# | #define HAVE_LIBSSH2 1
# | #define HAVE_LIBCARES 1
# | #define HAVE_ARES_ADDR_NODE 1
# | #define HAVE_ARES_SET_SERVERS 1
# | #define USE_LIBNETTLE_MD 1
# | #define ENABLE_SSL 1
# | #define ENABLE_BITTORRENT 1
# | #define ENABLE_METALINK 1
# | #define ENABLE_XML_RPC 1
# | #define ENABLE_ASYNC_DNS 1
# | #define HAVE_ALLOCA_H 1
# | #define HAVE_ALLOCA 1
# | #define STDC_HEADERS 1
# | #define HAVE_ARGZ_H 1
# | #define HAVE_ARPA_INET_H 1
# | #define HAVE_FCNTL_H 1
# | #define HAVE_FLOAT_H 1
# | #define HAVE_INTTYPES_H 1
# | #define HAVE_LANGINFO_H 1
# | #define HAVE_LIBINTL_H 1
# | #define HAVE_LIMITS_H 1
# | #define HAVE_LOCALE_H 1
# | #define HAVE_MALLOC_H 1
# | #define HAVE_NETDB_H 1
# | #define HAVE_NETINET_IN_H 1
# | #define HAVE_NETINET_TCP_H 1
# | #define HAVE_POLL_H 1
# | #define HAVE_SIGNAL_H 1
# | #define HAVE_STDDEF_H 1
# | #define HAVE_STDINT_H 1
# | #define HAVE_STDIO_EXT_H 1
# | #define HAVE_STDLIB_H 1
# | #define HAVE_STRING_H 1
# | #define HAVE_STRINGS_H 1
# | #define HAVE_SYS_IOCTL_H 1
# | #define HAVE_SYS_PARAM_H 1
# | #define HAVE_SYS_RESOURCE_H 1
# | #define HAVE_SYS_SIGNAL_H 1
# | #define HAVE_SYS_SOCKET_H 1
# | #define HAVE_SYS_TIME_H 1
# | #define HAVE_SYS_TYPES_H 1
# | #define HAVE_SYS_UIO_H 1
# | #define HAVE_SYS_UTSNAME_H 1
# | #define HAVE_TERMIOS_H 1
# | #define HAVE_UNISTD_H 1
# | #define HAVE_UTIME_H 1
# | #define HAVE_WCHAR_H 1
# | #define HAVE_IFADDRS_H 1
# | #define HAVE_PWD_H 1
# | /* end confdefs.h. */
# | #include
# | #ifdef HAVE_SYS_TYPES_H
# | # include
# | #endif
# | #ifdef HAVE_SYS_STAT_H
# | # include
# | #endif
# | #ifdef STDC_HEADERS
# | # include
# | # include
# | #else
# | # ifdef HAVE_STDLIB_H
# | # include
# | # endif
# | #endif
# | #ifdef HAVE_STRING_H
# | # if !defined STDC_HEADERS && defined HAVE_MEMORY_H
# | # include
# | # endif
# | # include
# | #endif
# | #ifdef HAVE_STRINGS_H
# | # include
# | #endif
# | #ifdef HAVE_INTTYPES_H
# | # include
# | #endif
# | #ifdef HAVE_STDINT_H
# | # include
# | #endif
# | #ifdef HAVE_UNISTD_H
# | # include
# | #endif
# | enum { N = 8 / 2 - 1 };
# | int
# | main ()
# | {
# | static int test_array [1 - 2 * !((int8_t) (((((int8_t) 1 << N) << N) - 1) * 2 + 1)
# | < (int8_t) (((((int8_t) 1 << N) << N) - 1) * 2 + 2))];
# | test_array [0] = 0;
# | return test_array [0];
# |
# | ;
# | return 0;
# | }
# configure:21714: result: yes
# configure:21725: checking for mode_t
# configure:21725: g++ -c conftest.cpp >&5
# configure:21725: $? = 0
# configure:21725: g++ -c conftest.cpp >&5
# conftest.cpp: In function 'int main()':
# conftest.cpp:129:20: error: expected primary-expression before ')' token
# if (sizeof ((mode_t)))
# ^
# configure:21725: $? = 1
# configure: failed program was:
# | /* confdefs.h */
# | #define PACKAGE_NAME "aria2"
# | #define PACKAGE_TARNAME "aria2"
# | #define PACKAGE_VERSION "1.24.0"
# | #define PACKAGE_STRING "aria2 1.24.0"
# | #define PACKAGE_BUGREPORT "https://github.com/aria2/aria2/issues"
# | #define PACKAGE_URL "https://aria2.github.io/"
# | #define PACKAGE "aria2"
# | #define VERSION "1.24.0"
# | #define STDC_HEADERS 1
# | #define HAVE_SYS_TYPES_H 1
# | #define HAVE_SYS_STAT_H 1
# | #define HAVE_STDLIB_H 1
# | #define HAVE_STRING_H 1
# | #define HAVE_MEMORY_H 1
# | #define HAVE_STRINGS_H 1
# | #define HAVE_INTTYPES_H 1
# | #define HAVE_STDINT_H 1
# | #define HAVE_UNISTD_H 1
# | #define __EXTENSIONS__ 1
# | #define _ALL_SOURCE 1
# | #define _GNU_SOURCE 1
# | #define _POSIX_PTHREAD_SEMANTICS 1
# | #define _TANDEM_SOURCE 1
# | #define HAVE_DLFCN_H 1
# | #define LT_OBJDIR ".libs/"
# | #define BUILD "x86_64-pc-linux-gnu"
# | #define HOST "x86_64-unknown-linux-gnu"
# | #define TARGET "x86_64-unknown-linux-gnu"
# | #define CA_BUNDLE "/etc/ssl/certs/ca-certificates.crt"
# | #define CXX11_OVERRIDE override
# | #define HAVE_ZLIB 1
# | #define HAVE_GZSETPARAMS 1
# | #define HAVE_LIBXML2 1
# | #define HAVE_SQLITE3 1
# | #define HAVE_SQLITE3_OPEN_V2 1
# | #define HAVE_LIBGNUTLS 1
# | #define HAVE_GNUTLS_CERTIFICATE_SET_X509_SYSTEM_TRUST 1
# | #define HAVE_LIBNETTLE 1
# | #define HAVE_LIBGMP 1
# | #define HAVE___GMPZ_POWM_SEC 1
# | #define HAVE_GMP_SEC 1
# | #define HAVE_LIBSSH2 1
# | #define HAVE_LIBCARES 1
# | #define HAVE_ARES_ADDR_NODE 1
# | #define HAVE_ARES_SET_SERVERS 1
# | #define USE_LIBNETTLE_MD 1
# | #define ENABLE_SSL 1
# | #define ENABLE_BITTORRENT 1
# | #define ENABLE_METALINK 1
# | #define ENABLE_XML_RPC 1
# | #define ENABLE_ASYNC_DNS 1
# | #define HAVE_ALLOCA_H 1
# | #define HAVE_ALLOCA 1
# | #define STDC_HEADERS 1
# | #define HAVE_ARGZ_H 1
# | #define HAVE_ARPA_INET_H 1
# | #define HAVE_FCNTL_H 1
# | #define HAVE_FLOAT_H 1
# | #define HAVE_INTTYPES_H 1
# | #define HAVE_LANGINFO_H 1
# | #define HAVE_LIBINTL_H 1
# | #define HAVE_LIMITS_H 1
# | #define HAVE_LOCALE_H 1
# | #define HAVE_MALLOC_H 1
# | #define HAVE_NETDB_H 1
# | #define HAVE_NETINET_IN_H 1
# | #define HAVE_NETINET_TCP_H 1
# | #define HAVE_POLL_H 1
# | #define HAVE_SIGNAL_H 1
# | #define HAVE_STDDEF_H 1
# | #define HAVE_STDINT_H 1
# | #define HAVE_STDIO_EXT_H 1
# | #define HAVE_STDLIB_H 1
# | #define HAVE_STRING_H 1
# | #define HAVE_STRINGS_H 1
# | #define HAVE_SYS_IOCTL_H 1
# | #define HAVE_SYS_PARAM_H 1
# | #define HAVE_SYS_RESOURCE_H 1
# | #define HAVE_SYS_SIGNAL_H 1
# | #define HAVE_SYS_SOCKET_H 1
# | #define HAVE_SYS_TIME_H 1
# | #define HAVE_SYS_TYPES_H 1
# | #define HAVE_SYS_UIO_H 1
# | #define HAVE_SYS_UTSNAME_H 1
# | #define HAVE_TERMIOS_H 1
# | #define HAVE_UNISTD_H 1
# | #define HAVE_UTIME_H 1
# | #define HAVE_WCHAR_H 1
# | #define HAVE_IFADDRS_H 1
# | #define HAVE_PWD_H 1
# | /* end confdefs.h. */
# | #include
# | #ifdef HAVE_SYS_TYPES_H
# | # include
# | #endif
# | #ifdef HAVE_SYS_STAT_H
# | # include
# | #endif
# | #ifdef STDC_HEADERS
# | # include
# | # include
# | #else
# | # ifdef HAVE_STDLIB_H
# | # include
# | # endif
# | #endif
# | #ifdef HAVE_STRING_H
# | # if !defined STDC_HEADERS && defined HAVE_MEMORY_H
# | # include
# | # endif
# | # include
# | #endif
# | #ifdef HAVE_STRINGS_H
# | # include
# | #endif
# | #ifdef HAVE_INTTYPES_H
# | # include
# | #endif
# | #ifdef HAVE_STDINT_H
# | # include
# | #endif
# | #ifdef HAVE_UNISTD_H
# | # include
# | #endif
# | int
# | main ()
# | {
# | if (sizeof ((mode_t)))
# | return 0;
# | ;
# | return 0;
# | }
# configure:21725: result: yes
# configure:21736: checking for off_t
# configure:21736: g++ -c conftest.cpp >&5
# configure:21736: $? = 0
# configure:21736: g++ -c conftest.cpp >&5
# conftest.cpp: In function 'int main()':
# conftest.cpp:129:19: error: expected primary-expression before ')' token
# if (sizeof ((off_t)))
# ^
# configure:21736: $? = 1
# configure: failed program was:
# | /* confdefs.h */
# | #define PACKAGE_NAME "aria2"
# | #define PACKAGE_TARNAME "aria2"
# | #define PACKAGE_VERSION "1.24.0"
# | #define PACKAGE_STRING "aria2 1.24.0"
# | #define PACKAGE_BUGREPORT "https://github.com/aria2/aria2/issues"
# | #define PACKAGE_URL "https://aria2.github.io/"
# | #define PACKAGE "aria2"
# | #define VERSION "1.24.0"
# | #define STDC_HEADERS 1
# | #define HAVE_SYS_TYPES_H 1
# | #define HAVE_SYS_STAT_H 1
# | #define HAVE_STDLIB_H 1
# | #define HAVE_STRING_H 1
# | #define HAVE_MEMORY_H 1
# | #define HAVE_STRINGS_H 1
# | #define HAVE_INTTYPES_H 1
# | #define HAVE_STDINT_H 1
# | #define HAVE_UNISTD_H 1
# | #define __EXTENSIONS__ 1
# | #define _ALL_SOURCE 1
# | #define _GNU_SOURCE 1
# | #define _POSIX_PTHREAD_SEMANTICS 1
# | #define _TANDEM_SOURCE 1
# | #define HAVE_DLFCN_H 1
# | #define LT_OBJDIR ".libs/"
# | #define BUILD "x86_64-pc-linux-gnu"
# | #define HOST "x86_64-unknown-linux-gnu"
# | #define TARGET "x86_64-unknown-linux-gnu"
# | #define CA_BUNDLE "/etc/ssl/certs/ca-certificates.crt"
# | #define CXX11_OVERRIDE override
# | #define HAVE_ZLIB 1
# | #define HAVE_GZSETPARAMS 1
# | #define HAVE_LIBXML2 1
# | #define HAVE_SQLITE3 1
# | #define HAVE_SQLITE3_OPEN_V2 1
# | #define HAVE_LIBGNUTLS 1
# | #define HAVE_GNUTLS_CERTIFICATE_SET_X509_SYSTEM_TRUST 1
# | #define HAVE_LIBNETTLE 1
# | #define HAVE_LIBGMP 1
# | #define HAVE___GMPZ_POWM_SEC 1
# | #define HAVE_GMP_SEC 1
# | #define HAVE_LIBSSH2 1
# | #define HAVE_LIBCARES 1
# | #define HAVE_ARES_ADDR_NODE 1
# | #define HAVE_ARES_SET_SERVERS 1
# | #define USE_LIBNETTLE_MD 1
# | #define ENABLE_SSL 1
# | #define ENABLE_BITTORRENT 1
# | #define ENABLE_METALINK 1
# | #define ENABLE_XML_RPC 1
# | #define ENABLE_ASYNC_DNS 1
# | #define HAVE_ALLOCA_H 1
# | #define HAVE_ALLOCA 1
# | #define STDC_HEADERS 1
# | #define HAVE_ARGZ_H 1
# | #define HAVE_ARPA_INET_H 1
# | #define HAVE_FCNTL_H 1
# | #define HAVE_FLOAT_H 1
# | #define HAVE_INTTYPES_H 1
# | #define HAVE_LANGINFO_H 1
# | #define HAVE_LIBINTL_H 1
# | #define HAVE_LIMITS_H 1
# | #define HAVE_LOCALE_H 1
# | #define HAVE_MALLOC_H 1
# | #define HAVE_NETDB_H 1
# | #define HAVE_NETINET_IN_H 1
# | #define HAVE_NETINET_TCP_H 1
# | #define HAVE_POLL_H 1
# | #define HAVE_SIGNAL_H 1
# | #define HAVE_STDDEF_H 1
# | #define HAVE_STDINT_H 1
# | #define HAVE_STDIO_EXT_H 1
# | #define HAVE_STDLIB_H 1
# | #define HAVE_STRING_H 1
# | #define HAVE_STRINGS_H 1
# | #define HAVE_SYS_IOCTL_H 1
# | #define HAVE_SYS_PARAM_H 1
# | #define HAVE_SYS_RESOURCE_H 1
# | #define HAVE_SYS_SIGNAL_H 1
# | #define HAVE_SYS_SOCKET_H 1
# | #define HAVE_SYS_TIME_H 1
# | #define HAVE_SYS_TYPES_H 1
# | #define HAVE_SYS_UIO_H 1
# | #define HAVE_SYS_UTSNAME_H 1
# | #define HAVE_TERMIOS_H 1
# | #define HAVE_UNISTD_H 1
# | #define HAVE_UTIME_H 1
# | #define HAVE_WCHAR_H 1
# | #define HAVE_IFADDRS_H 1
# | #define HAVE_PWD_H 1
# | /* end confdefs.h. */
# | #include
# | #ifdef HAVE_SYS_TYPES_H
# | # include
# | #endif
# | #ifdef HAVE_SYS_STAT_H
# | # include
# | #endif
# | #ifdef STDC_HEADERS
# | # include
# | # include
# | #else
# | # ifdef HAVE_STDLIB_H
# | # include
# | # endif
# | #endif
# | #ifdef HAVE_STRING_H
# | # if !defined STDC_HEADERS && defined HAVE_MEMORY_H
# | # include
# | # endif
# | # include
# | #endif
# | #ifdef HAVE_STRINGS_H
# | # include
# | #endif
# | #ifdef HAVE_INTTYPES_H
# | # include
# | #endif
# | #ifdef HAVE_STDINT_H
# | # include
# | #endif
# | #ifdef HAVE_UNISTD_H
# | # include
# | #endif
# | int
# | main ()
# | {
# | if (sizeof ((off_t)))
# | return 0;
# | ;
# | return 0;
# | }
# configure:21736: result: yes
# configure:21747: checking for size_t
# configure:21747: result: yes
# configure:21758: checking for ssize_t
# configure:21758: g++ -c conftest.cpp >&5
# configure:21758: $? = 0
# configure:21758: g++ -c conftest.cpp >&5
# conftest.cpp: In function 'int main()':
# conftest.cpp:129:21: error: expected primary-expression before ')' token
# if (sizeof ((ssize_t)))
# ^
# configure:21758: $? = 1
# configure: failed program was:
# | /* confdefs.h */
# | #define PACKAGE_NAME "aria2"
# | #define PACKAGE_TARNAME "aria2"
# | #define PACKAGE_VERSION "1.24.0"
# | #define PACKAGE_STRING "aria2 1.24.0"
# | #define PACKAGE_BUGREPORT "https://github.com/aria2/aria2/issues"
# | #define PACKAGE_URL "https://aria2.github.io/"
# | #define PACKAGE "aria2"
# | #define VERSION "1.24.0"
# | #define STDC_HEADERS 1
# | #define HAVE_SYS_TYPES_H 1
# | #define HAVE_SYS_STAT_H 1
# | #define HAVE_STDLIB_H 1
# | #define HAVE_STRING_H 1
# | #define HAVE_MEMORY_H 1
# | #define HAVE_STRINGS_H 1
# | #define HAVE_INTTYPES_H 1
# | #define HAVE_STDINT_H 1
# | #define HAVE_UNISTD_H 1
# | #define __EXTENSIONS__ 1
# | #define _ALL_SOURCE 1
# | #define _GNU_SOURCE 1
# | #define _POSIX_PTHREAD_SEMANTICS 1
# | #define _TANDEM_SOURCE 1
# | #define HAVE_DLFCN_H 1
# | #define LT_OBJDIR ".libs/"
# | #define BUILD "x86_64-pc-linux-gnu"
# | #define HOST "x86_64-unknown-linux-gnu"
# | #define TARGET "x86_64-unknown-linux-gnu"
# | #define CA_BUNDLE "/etc/ssl/certs/ca-certificates.crt"
# | #define CXX11_OVERRIDE override
# | #define HAVE_ZLIB 1
# | #define HAVE_GZSETPARAMS 1
# | #define HAVE_LIBXML2 1
# | #define HAVE_SQLITE3 1
# | #define HAVE_SQLITE3_OPEN_V2 1
# | #define HAVE_LIBGNUTLS 1
# | #define HAVE_GNUTLS_CERTIFICATE_SET_X509_SYSTEM_TRUST 1
# | #define HAVE_LIBNETTLE 1
# | #define HAVE_LIBGMP 1
# | #define HAVE___GMPZ_POWM_SEC 1
# | #define HAVE_GMP_SEC 1
# | #define HAVE_LIBSSH2 1
# | #define HAVE_LIBCARES 1
# | #define HAVE_ARES_ADDR_NODE 1
# | #define HAVE_ARES_SET_SERVERS 1
# | #define USE_LIBNETTLE_MD 1
# | #define ENABLE_SSL 1
# | #define ENABLE_BITTORRENT 1
# | #define ENABLE_METALINK 1
# | #define ENABLE_XML_RPC 1
# | #define ENABLE_ASYNC_DNS 1
# | #define HAVE_ALLOCA_H 1
# | #define HAVE_ALLOCA 1
# | #define STDC_HEADERS 1
# | #define HAVE_ARGZ_H 1
# | #define HAVE_ARPA_INET_H 1
# | #define HAVE_FCNTL_H 1
# | #define HAVE_FLOAT_H 1
# | #define HAVE_INTTYPES_H 1
# | #define HAVE_LANGINFO_H 1
# | #define HAVE_LIBINTL_H 1
# | #define HAVE_LIMITS_H 1
# | #define HAVE_LOCALE_H 1
# | #define HAVE_MALLOC_H 1
# | #define HAVE_NETDB_H 1
# | #define HAVE_NETINET_IN_H 1
# | #define HAVE_NETINET_TCP_H 1
# | #define HAVE_POLL_H 1
# | #define HAVE_SIGNAL_H 1
# | #define HAVE_STDDEF_H 1
# | #define HAVE_STDINT_H 1
# | #define HAVE_STDIO_EXT_H 1
# | #define HAVE_STDLIB_H 1
# | #define HAVE_STRING_H 1
# | #define HAVE_STRINGS_H 1
# | #define HAVE_SYS_IOCTL_H 1
# | #define HAVE_SYS_PARAM_H 1
# | #define HAVE_SYS_RESOURCE_H 1
# | #define HAVE_SYS_SIGNAL_H 1
# | #define HAVE_SYS_SOCKET_H 1
# | #define HAVE_SYS_TIME_H 1
# | #define HAVE_SYS_TYPES_H 1
# | #define HAVE_SYS_UIO_H 1
# | #define HAVE_SYS_UTSNAME_H 1
# | #define HAVE_TERMIOS_H 1
# | #define HAVE_UNISTD_H 1
# | #define HAVE_UTIME_H 1
# | #define HAVE_WCHAR_H 1
# | #define HAVE_IFADDRS_H 1
# | #define HAVE_PWD_H 1
# | /* end confdefs.h. */
# | #include
# | #ifdef HAVE_SYS_TYPES_H
# | # include
# | #endif
# | #ifdef HAVE_SYS_STAT_H
# | # include
# | #endif
# | #ifdef STDC_HEADERS
# | # include
# | # include
# | #else
# | # ifdef HAVE_STDLIB_H
# | # include
# | # endif
# | #endif
# | #ifdef HAVE_STRING_H
# | # if !defined STDC_HEADERS && defined HAVE_MEMORY_H
# | # include
# | # endif
# | # include
# | #endif
# | #ifdef HAVE_STRINGS_H
# | # include
# | #endif
# | #ifdef HAVE_INTTYPES_H
# | # include
# | #endif
# | #ifdef HAVE_STDINT_H
# | # include
# | #endif
# | #ifdef HAVE_UNISTD_H
# | # include
# | #endif
# | int
# | main ()
# | {
# | if (sizeof ((ssize_t)))
# | return 0;
# | ;
# | return 0;
# | }
# configure:21758: result: yes
# configure:21769: checking whether time.h and sys/time.h may both be included
# configure:21789: g++ -c conftest.cpp >&5
# configure:21789: $? = 0
# configure:21796: result: yes
# configure:21804: checking whether struct tm is in sys/time.h or time.h
# configure:21824: g++ -c conftest.cpp >&5
# configure:21824: $? = 0
# configure:21831: result: time.h
# configure:21839: checking for uint16_t
# configure:21839: g++ -c conftest.cpp >&5
# configure:21839: $? = 0
# configure:21839: result: yes
# configure:21851: checking for uint32_t
# configure:21851: g++ -c conftest.cpp >&5
# configure:21851: $? = 0
# configure:21851: result: yes
# configure:21865: checking for uint64_t
# configure:21865: g++ -c conftest.cpp >&5
# configure:21865: $? = 0
# configure:21865: result: yes
# configure:21879: checking for uint8_t
# configure:21879: g++ -c conftest.cpp >&5
# configure:21879: $? = 0
# configure:21879: result: yes
# configure:21893: checking for pid_t
# configure:21893: g++ -c conftest.cpp >&5
# configure:21893: $? = 0
# configure:21893: g++ -c conftest.cpp >&5
# conftest.cpp: In function 'int main()':
# conftest.cpp:130:19: error: expected primary-expression before ')' token
# if (sizeof ((pid_t)))
# ^
# configure:21893: $? = 1
# configure: failed program was:
# | /* confdefs.h */
# | #define PACKAGE_NAME "aria2"
# | #define PACKAGE_TARNAME "aria2"
# | #define PACKAGE_VERSION "1.24.0"
# | #define PACKAGE_STRING "aria2 1.24.0"
# | #define PACKAGE_BUGREPORT "https://github.com/aria2/aria2/issues"
# | #define PACKAGE_URL "https://aria2.github.io/"
# | #define PACKAGE "aria2"
# | #define VERSION "1.24.0"
# | #define STDC_HEADERS 1
# | #define HAVE_SYS_TYPES_H 1
# | #define HAVE_SYS_STAT_H 1
# | #define HAVE_STDLIB_H 1
# | #define HAVE_STRING_H 1
# | #define HAVE_MEMORY_H 1
# | #define HAVE_STRINGS_H 1
# | #define HAVE_INTTYPES_H 1
# | #define HAVE_STDINT_H 1
# | #define HAVE_UNISTD_H 1
# | #define __EXTENSIONS__ 1
# | #define _ALL_SOURCE 1
# | #define _GNU_SOURCE 1
# | #define _POSIX_PTHREAD_SEMANTICS 1
# | #define _TANDEM_SOURCE 1
# | #define HAVE_DLFCN_H 1
# | #define LT_OBJDIR ".libs/"
# | #define BUILD "x86_64-pc-linux-gnu"
# | #define HOST "x86_64-unknown-linux-gnu"
# | #define TARGET "x86_64-unknown-linux-gnu"
# | #define CA_BUNDLE "/etc/ssl/certs/ca-certificates.crt"
# | #define CXX11_OVERRIDE override
# | #define HAVE_ZLIB 1
# | #define HAVE_GZSETPARAMS 1
# | #define HAVE_LIBXML2 1
# | #define HAVE_SQLITE3 1
# | #define HAVE_SQLITE3_OPEN_V2 1
# | #define HAVE_LIBGNUTLS 1
# | #define HAVE_GNUTLS_CERTIFICATE_SET_X509_SYSTEM_TRUST 1
# | #define HAVE_LIBNETTLE 1
# | #define HAVE_LIBGMP 1
# | #define HAVE___GMPZ_POWM_SEC 1
# | #define HAVE_GMP_SEC 1
# | #define HAVE_LIBSSH2 1
# | #define HAVE_LIBCARES 1
# | #define HAVE_ARES_ADDR_NODE 1
# | #define HAVE_ARES_SET_SERVERS 1
# | #define USE_LIBNETTLE_MD 1
# | #define ENABLE_SSL 1
# | #define ENABLE_BITTORRENT 1
# | #define ENABLE_METALINK 1
# | #define ENABLE_XML_RPC 1
# | #define ENABLE_ASYNC_DNS 1
# | #define HAVE_ALLOCA_H 1
# | #define HAVE_ALLOCA 1
# | #define STDC_HEADERS 1
# | #define HAVE_ARGZ_H 1
# | #define HAVE_ARPA_INET_H 1
# | #define HAVE_FCNTL_H 1
# | #define HAVE_FLOAT_H 1
# | #define HAVE_INTTYPES_H 1
# | #define HAVE_LANGINFO_H 1
# | #define HAVE_LIBINTL_H 1
# | #define HAVE_LIMITS_H 1
# | #define HAVE_LOCALE_H 1
# | #define HAVE_MALLOC_H 1
# | #define HAVE_NETDB_H 1
# | #define HAVE_NETINET_IN_H 1
# | #define HAVE_NETINET_TCP_H 1
# | #define HAVE_POLL_H 1
# | #define HAVE_SIGNAL_H 1
# | #define HAVE_STDDEF_H 1
# | #define HAVE_STDINT_H 1
# | #define HAVE_STDIO_EXT_H 1
# | #define HAVE_STDLIB_H 1
# | #define HAVE_STRING_H 1
# | #define HAVE_STRINGS_H 1
# | #define HAVE_SYS_IOCTL_H 1
# | #define HAVE_SYS_PARAM_H 1
# | #define HAVE_SYS_RESOURCE_H 1
# | #define HAVE_SYS_SIGNAL_H 1
# | #define HAVE_SYS_SOCKET_H 1
# | #define HAVE_SYS_TIME_H 1
# | #define HAVE_SYS_TYPES_H 1
# | #define HAVE_SYS_UIO_H 1
# | #define HAVE_SYS_UTSNAME_H 1
# | #define HAVE_TERMIOS_H 1
# | #define HAVE_UNISTD_H 1
# | #define HAVE_UTIME_H 1
# | #define HAVE_WCHAR_H 1
# | #define HAVE_IFADDRS_H 1
# | #define HAVE_PWD_H 1
# | #define TIME_WITH_SYS_TIME 1
# | /* end confdefs.h. */
# | #include
# | #ifdef HAVE_SYS_TYPES_H
# | # include
# | #endif
# | #ifdef HAVE_SYS_STAT_H
# | # include
# | #endif
# | #ifdef STDC_HEADERS
# | # include
# | # include
# | #else
# | # ifdef HAVE_STDLIB_H
# | # include
# | # endif
# | #endif
# | #ifdef HAVE_STRING_H
# | # if !defined STDC_HEADERS && defined HAVE_MEMORY_H
# | # include
# | # endif
# | # include
# | #endif
# | #ifdef HAVE_STRINGS_H
# | # include
# | #endif
# | #ifdef HAVE_INTTYPES_H
# | # include
# | #endif
# | #ifdef HAVE_STDINT_H
# | # include
# | #endif
# | #ifdef HAVE_UNISTD_H
# | # include
# | #endif
# | int
# | main ()
# | {
# | if (sizeof ((pid_t)))
# | return 0;
# | ;
# | return 0;
# | }
# configure:21893: result: yes
# configure:21904: checking for working volatile
# configure:21923: g++ -c conftest.cpp >&5
# configure:21923: $? = 0
# configure:21930: result: yes
# configure:21938: checking for ptrdiff_t
# configure:21938: g++ -c conftest.cpp >&5
# configure:21938: $? = 0
# configure:21938: g++ -c conftest.cpp >&5
# conftest.cpp: In function 'int main()':
# conftest.cpp:130:23: error: expected primary-expression before ')' token
# if (sizeof ((ptrdiff_t)))
# ^
# configure:21938: $? = 1
# configure: failed program was:
# | /* confdefs.h */
# | #define PACKAGE_NAME "aria2"
# | #define PACKAGE_TARNAME "aria2"
# | #define PACKAGE_VERSION "1.24.0"
# | #define PACKAGE_STRING "aria2 1.24.0"
# | #define PACKAGE_BUGREPORT "https://github.com/aria2/aria2/issues"
# | #define PACKAGE_URL "https://aria2.github.io/"
# | #define PACKAGE "aria2"
# | #define VERSION "1.24.0"
# | #define STDC_HEADERS 1
# | #define HAVE_SYS_TYPES_H 1
# | #define HAVE_SYS_STAT_H 1
# | #define HAVE_STDLIB_H 1
# | #define HAVE_STRING_H 1
# | #define HAVE_MEMORY_H 1
# | #define HAVE_STRINGS_H 1
# | #define HAVE_INTTYPES_H 1
# | #define HAVE_STDINT_H 1
# | #define HAVE_UNISTD_H 1
# | #define __EXTENSIONS__ 1
# | #define _ALL_SOURCE 1
# | #define _GNU_SOURCE 1
# | #define _POSIX_PTHREAD_SEMANTICS 1
# | #define _TANDEM_SOURCE 1
# | #define HAVE_DLFCN_H 1
# | #define LT_OBJDIR ".libs/"
# | #define BUILD "x86_64-pc-linux-gnu"
# | #define HOST "x86_64-unknown-linux-gnu"
# | #define TARGET "x86_64-unknown-linux-gnu"
# | #define CA_BUNDLE "/etc/ssl/certs/ca-certificates.crt"
# | #define CXX11_OVERRIDE override
# | #define HAVE_ZLIB 1
# | #define HAVE_GZSETPARAMS 1
# | #define HAVE_LIBXML2 1
# | #define HAVE_SQLITE3 1
# | #define HAVE_SQLITE3_OPEN_V2 1
# | #define HAVE_LIBGNUTLS 1
# | #define HAVE_GNUTLS_CERTIFICATE_SET_X509_SYSTEM_TRUST 1
# | #define HAVE_LIBNETTLE 1
# | #define HAVE_LIBGMP 1
# | #define HAVE___GMPZ_POWM_SEC 1
# | #define HAVE_GMP_SEC 1
# | #define HAVE_LIBSSH2 1
# | #define HAVE_LIBCARES 1
# | #define HAVE_ARES_ADDR_NODE 1
# | #define HAVE_ARES_SET_SERVERS 1
# | #define USE_LIBNETTLE_MD 1
# | #define ENABLE_SSL 1
# | #define ENABLE_BITTORRENT 1
# | #define ENABLE_METALINK 1
# | #define ENABLE_XML_RPC 1
# | #define ENABLE_ASYNC_DNS 1
# | #define HAVE_ALLOCA_H 1
# | #define HAVE_ALLOCA 1
# | #define STDC_HEADERS 1
# | #define HAVE_ARGZ_H 1
# | #define HAVE_ARPA_INET_H 1
# | #define HAVE_FCNTL_H 1
# | #define HAVE_FLOAT_H 1
# | #define HAVE_INTTYPES_H 1
# | #define HAVE_LANGINFO_H 1
# | #define HAVE_LIBINTL_H 1
# | #define HAVE_LIMITS_H 1
# | #define HAVE_LOCALE_H 1
# | #define HAVE_MALLOC_H 1
# | #define HAVE_NETDB_H 1
# | #define HAVE_NETINET_IN_H 1
# | #define HAVE_NETINET_TCP_H 1
# | #define HAVE_POLL_H 1
# | #define HAVE_SIGNAL_H 1
# | #define HAVE_STDDEF_H 1
# | #define HAVE_STDINT_H 1
# | #define HAVE_STDIO_EXT_H 1
# | #define HAVE_STDLIB_H 1
# | #define HAVE_STRING_H 1
# | #define HAVE_STRINGS_H 1
# | #define HAVE_SYS_IOCTL_H 1
# | #define HAVE_SYS_PARAM_H 1
# | #define HAVE_SYS_RESOURCE_H 1
# | #define HAVE_SYS_SIGNAL_H 1
# | #define HAVE_SYS_SOCKET_H 1
# | #define HAVE_SYS_TIME_H 1
# | #define HAVE_SYS_TYPES_H 1
# | #define HAVE_SYS_UIO_H 1
# | #define HAVE_SYS_UTSNAME_H 1
# | #define HAVE_TERMIOS_H 1
# | #define HAVE_UNISTD_H 1
# | #define HAVE_UTIME_H 1
# | #define HAVE_WCHAR_H 1
# | #define HAVE_IFADDRS_H 1
# | #define HAVE_PWD_H 1
# | #define TIME_WITH_SYS_TIME 1
# | /* end confdefs.h. */
# | #include
# | #ifdef HAVE_SYS_TYPES_H
# | # include
# | #endif
# | #ifdef HAVE_SYS_STAT_H
# | # include
# | #endif
# | #ifdef STDC_HEADERS
# | # include
# | # include
# | #else
# | # ifdef HAVE_STDLIB_H
# | # include
# | # endif
# | #endif
# | #ifdef HAVE_STRING_H
# | # if !defined STDC_HEADERS && defined HAVE_MEMORY_H
# | # include
# | # endif
# | # include
# | #endif
# | #ifdef HAVE_STRINGS_H
# | # include
# | #endif
# | #ifdef HAVE_INTTYPES_H
# | # include
# | #endif
# | #ifdef HAVE_STDINT_H
# | # include
# | #endif
# | #ifdef HAVE_UNISTD_H
# | # include
# | #endif
# | int
# | main ()
# | {
# | if (sizeof ((ptrdiff_t)))
# | return 0;
# | ;
# | return 0;
# | }
# configure:21938: result: yes
# configure:21948: checking for struct timespec
# configure:21948: g++ -c conftest.cpp >&5
# configure:21948: $? = 0
# configure:21948: g++ -c conftest.cpp >&5
# conftest.cpp: In function 'int main()':
# conftest.cpp:131:14: error: expected primary-expression before 'struct'
# if (sizeof ((struct timespec)))
# ^~~~~~
# conftest.cpp:131:14: error: expected ')' before 'struct'
# conftest.cpp:132:14: error: expected ')' before ';' token
# return 0;
# ^
# conftest.cpp:132:14: error: expected ')' before ';' token
# configure:21948: $? = 1
# configure: failed program was:
# | /* confdefs.h */
# | #define PACKAGE_NAME "aria2"
# | #define PACKAGE_TARNAME "aria2"
# | #define PACKAGE_VERSION "1.24.0"
# | #define PACKAGE_STRING "aria2 1.24.0"
# | #define PACKAGE_BUGREPORT "https://github.com/aria2/aria2/issues"
# | #define PACKAGE_URL "https://aria2.github.io/"
# | #define PACKAGE "aria2"
# | #define VERSION "1.24.0"
# | #define STDC_HEADERS 1
# | #define HAVE_SYS_TYPES_H 1
# | #define HAVE_SYS_STAT_H 1
# | #define HAVE_STDLIB_H 1
# | #define HAVE_STRING_H 1
# | #define HAVE_MEMORY_H 1
# | #define HAVE_STRINGS_H 1
# | #define HAVE_INTTYPES_H 1
# | #define HAVE_STDINT_H 1
# | #define HAVE_UNISTD_H 1
# | #define __EXTENSIONS__ 1
# | #define _ALL_SOURCE 1
# | #define _GNU_SOURCE 1
# | #define _POSIX_PTHREAD_SEMANTICS 1
# | #define _TANDEM_SOURCE 1
# | #define HAVE_DLFCN_H 1
# | #define LT_OBJDIR ".libs/"
# | #define BUILD "x86_64-pc-linux-gnu"
# | #define HOST "x86_64-unknown-linux-gnu"
# | #define TARGET "x86_64-unknown-linux-gnu"
# | #define CA_BUNDLE "/etc/ssl/certs/ca-certificates.crt"
# | #define CXX11_OVERRIDE override
# | #define HAVE_ZLIB 1
# | #define HAVE_GZSETPARAMS 1
# | #define HAVE_LIBXML2 1
# | #define HAVE_SQLITE3 1
# | #define HAVE_SQLITE3_OPEN_V2 1
# | #define HAVE_LIBGNUTLS 1
# | #define HAVE_GNUTLS_CERTIFICATE_SET_X509_SYSTEM_TRUST 1
# | #define HAVE_LIBNETTLE 1
# | #define HAVE_LIBGMP 1
# | #define HAVE___GMPZ_POWM_SEC 1
# | #define HAVE_GMP_SEC 1
# | #define HAVE_LIBSSH2 1
# | #define HAVE_LIBCARES 1
# | #define HAVE_ARES_ADDR_NODE 1
# | #define HAVE_ARES_SET_SERVERS 1
# | #define USE_LIBNETTLE_MD 1
# | #define ENABLE_SSL 1
# | #define ENABLE_BITTORRENT 1
# | #define ENABLE_METALINK 1
# | #define ENABLE_XML_RPC 1
# | #define ENABLE_ASYNC_DNS 1
# | #define HAVE_ALLOCA_H 1
# | #define HAVE_ALLOCA 1
# | #define STDC_HEADERS 1
# | #define HAVE_ARGZ_H 1
# | #define HAVE_ARPA_INET_H 1
# | #define HAVE_FCNTL_H 1
# | #define HAVE_FLOAT_H 1
# | #define HAVE_INTTYPES_H 1
# | #define HAVE_LANGINFO_H 1
# | #define HAVE_LIBINTL_H 1
# | #define HAVE_LIMITS_H 1
# | #define HAVE_LOCALE_H 1
# | #define HAVE_MALLOC_H 1
# | #define HAVE_NETDB_H 1
# | #define HAVE_NETINET_IN_H 1
# | #define HAVE_NETINET_TCP_H 1
# | #define HAVE_POLL_H 1
# | #define HAVE_SIGNAL_H 1
# | #define HAVE_STDDEF_H 1
# | #define HAVE_STDINT_H 1
# | #define HAVE_STDIO_EXT_H 1
# | #define HAVE_STDLIB_H 1
# | #define HAVE_STRING_H 1
# | #define HAVE_STRINGS_H 1
# | #define HAVE_SYS_IOCTL_H 1
# | #define HAVE_SYS_PARAM_H 1
# | #define HAVE_SYS_RESOURCE_H 1
# | #define HAVE_SYS_SIGNAL_H 1
# | #define HAVE_SYS_SOCKET_H 1
# | #define HAVE_SYS_TIME_H 1
# | #define HAVE_SYS_TYPES_H 1
# | #define HAVE_SYS_UIO_H 1
# | #define HAVE_SYS_UTSNAME_H 1
# | #define HAVE_TERMIOS_H 1
# | #define HAVE_UNISTD_H 1
# | #define HAVE_UTIME_H 1
# | #define HAVE_WCHAR_H 1
# | #define HAVE_IFADDRS_H 1
# | #define HAVE_PWD_H 1
# | #define TIME_WITH_SYS_TIME 1
# | #define HAVE_PTRDIFF_T 1
# | /* end confdefs.h. */
# | #include
# | #ifdef HAVE_SYS_TYPES_H
# | # include
# | #endif
# | #ifdef HAVE_SYS_STAT_H
# | # include
# | #endif
# | #ifdef STDC_HEADERS
# | # include
# | # include
# | #else
# | # ifdef HAVE_STDLIB_H
# | # include
# | # endif
# | #endif
# | #ifdef HAVE_STRING_H
# | # if !defined STDC_HEADERS && defined HAVE_MEMORY_H
# | # include
# | # endif
# | # include
# | #endif
# | #ifdef HAVE_STRINGS_H
# | # include
# | #endif
# | #ifdef HAVE_INTTYPES_H
# | # include
# | #endif
# | #ifdef HAVE_STDINT_H
# | # include
# | #endif
# | #ifdef HAVE_UNISTD_H
# | # include
# | #endif
# | int
# | main ()
# | {
# | if (sizeof ((struct timespec)))
# | return 0;
# | ;
# | return 0;
# | }
# configure:21948: result: yes
# configure:21955: checking whether byte ordering is bigendian
# configure:21970: g++ -c conftest.cpp >&5
# conftest.cpp:96:9: error: expected unqualified-id before 'not' token
# not a universal capable compiler
# ^~~
# configure:21970: $? = 1
# configure: failed program was:
# | /* confdefs.h */
# | #define PACKAGE_NAME "aria2"
# | #define PACKAGE_TARNAME "aria2"
# | #define PACKAGE_VERSION "1.24.0"
# | #define PACKAGE_STRING "aria2 1.24.0"
# | #define PACKAGE_BUGREPORT "https://github.com/aria2/aria2/issues"
# | #define PACKAGE_URL "https://aria2.github.io/"
# | #define PACKAGE "aria2"
# | #define VERSION "1.24.0"
# | #define STDC_HEADERS 1
# | #define HAVE_SYS_TYPES_H 1
# | #define HAVE_SYS_STAT_H 1
# | #define HAVE_STDLIB_H 1
# | #define HAVE_STRING_H 1
# | #define HAVE_MEMORY_H 1
# | #define HAVE_STRINGS_H 1
# | #define HAVE_INTTYPES_H 1
# | #define HAVE_STDINT_H 1
# | #define HAVE_UNISTD_H 1
# | #define __EXTENSIONS__ 1
# | #define _ALL_SOURCE 1
# | #define _GNU_SOURCE 1
# | #define _POSIX_PTHREAD_SEMANTICS 1
# | #define _TANDEM_SOURCE 1
# | #define HAVE_DLFCN_H 1
# | #define LT_OBJDIR ".libs/"
# | #define BUILD "x86_64-pc-linux-gnu"
# | #define HOST "x86_64-unknown-linux-gnu"
# | #define TARGET "x86_64-unknown-linux-gnu"
# | #define CA_BUNDLE "/etc/ssl/certs/ca-certificates.crt"
# | #define CXX11_OVERRIDE override
# | #define HAVE_ZLIB 1
# | #define HAVE_GZSETPARAMS 1
# | #define HAVE_LIBXML2 1
# | #define HAVE_SQLITE3 1
# | #define HAVE_SQLITE3_OPEN_V2 1
# | #define HAVE_LIBGNUTLS 1
# | #define HAVE_GNUTLS_CERTIFICATE_SET_X509_SYSTEM_TRUST 1
# | #define HAVE_LIBNETTLE 1
# | #define HAVE_LIBGMP 1
# | #define HAVE___GMPZ_POWM_SEC 1
# | #define HAVE_GMP_SEC 1
# | #define HAVE_LIBSSH2 1
# | #define HAVE_LIBCARES 1
# | #define HAVE_ARES_ADDR_NODE 1
# | #define HAVE_ARES_SET_SERVERS 1
# | #define USE_LIBNETTLE_MD 1
# | #define ENABLE_SSL 1
# | #define ENABLE_BITTORRENT 1
# | #define ENABLE_METALINK 1
# | #define ENABLE_XML_RPC 1
# | #define ENABLE_ASYNC_DNS 1
# | #define HAVE_ALLOCA_H 1
# | #define HAVE_ALLOCA 1
# | #define STDC_HEADERS 1
# | #define HAVE_ARGZ_H 1
# | #define HAVE_ARPA_INET_H 1
# | #define HAVE_FCNTL_H 1
# | #define HAVE_FLOAT_H 1
# | #define HAVE_INTTYPES_H 1
# | #define HAVE_LANGINFO_H 1
# | #define HAVE_LIBINTL_H 1
# | #define HAVE_LIMITS_H 1
# | #define HAVE_LOCALE_H 1
# | #define HAVE_MALLOC_H 1
# | #define HAVE_NETDB_H 1
# | #define HAVE_NETINET_IN_H 1
# | #define HAVE_NETINET_TCP_H 1
# | #define HAVE_POLL_H 1
# | #define HAVE_SIGNAL_H 1
# | #define HAVE_STDDEF_H 1
# | #define HAVE_STDINT_H 1
# | #define HAVE_STDIO_EXT_H 1
# | #define HAVE_STDLIB_H 1
# | #define HAVE_STRING_H 1
# | #define HAVE_STRINGS_H 1
# | #define HAVE_SYS_IOCTL_H 1
# | #define HAVE_SYS_PARAM_H 1
# | #define HAVE_SYS_RESOURCE_H 1
# | #define HAVE_SYS_SIGNAL_H 1
# | #define HAVE_SYS_SOCKET_H 1
# | #define HAVE_SYS_TIME_H 1
# | #define HAVE_SYS_TYPES_H 1
# | #define HAVE_SYS_UIO_H 1
# | #define HAVE_SYS_UTSNAME_H 1
# | #define HAVE_TERMIOS_H 1
# | #define HAVE_UNISTD_H 1
# | #define HAVE_UTIME_H 1
# | #define HAVE_WCHAR_H 1
# | #define HAVE_IFADDRS_H 1
# | #define HAVE_PWD_H 1
# | #define TIME_WITH_SYS_TIME 1
# | #define HAVE_PTRDIFF_T 1
# | /* end confdefs.h. */
# | #ifndef __APPLE_CC__
# | not a universal capable compiler
# | #endif
# | typedef int dummy;
# |
# configure:22015: g++ -c conftest.cpp >&5
# configure:22015: $? = 0
# configure:22033: g++ -c conftest.cpp >&5
# conftest.cpp: In function 'int main()':
# conftest.cpp:102:8: error: 'big' was not declared in this scope
# not big endian
# ^~~
# configure:22033: $? = 1
# configure: failed program was:
# | /* confdefs.h */
# | #define PACKAGE_NAME "aria2"
# | #define PACKAGE_TARNAME "aria2"
# | #define PACKAGE_VERSION "1.24.0"
# | #define PACKAGE_STRING "aria2 1.24.0"
# | #define PACKAGE_BUGREPORT "https://github.com/aria2/aria2/issues"
# | #define PACKAGE_URL "https://aria2.github.io/"
# | #define PACKAGE "aria2"
# | #define VERSION "1.24.0"
# | #define STDC_HEADERS 1
# | #define HAVE_SYS_TYPES_H 1
# | #define HAVE_SYS_STAT_H 1
# | #define HAVE_STDLIB_H 1
# | #define HAVE_STRING_H 1
# | #define HAVE_MEMORY_H 1
# | #define HAVE_STRINGS_H 1
# | #define HAVE_INTTYPES_H 1
# | #define HAVE_STDINT_H 1
# | #define HAVE_UNISTD_H 1
# | #define __EXTENSIONS__ 1
# | #define _ALL_SOURCE 1
# | #define _GNU_SOURCE 1
# | #define _POSIX_PTHREAD_SEMANTICS 1
# | #define _TANDEM_SOURCE 1
# | #define HAVE_DLFCN_H 1
# | #define LT_OBJDIR ".libs/"
# | #define BUILD "x86_64-pc-linux-gnu"
# | #define HOST "x86_64-unknown-linux-gnu"
# | #define TARGET "x86_64-unknown-linux-gnu"
# | #define CA_BUNDLE "/etc/ssl/certs/ca-certificates.crt"
# | #define CXX11_OVERRIDE override
# | #define HAVE_ZLIB 1
# | #define HAVE_GZSETPARAMS 1
# | #define HAVE_LIBXML2 1
# | #define HAVE_SQLITE3 1
# | #define HAVE_SQLITE3_OPEN_V2 1
# | #define HAVE_LIBGNUTLS 1
# | #define HAVE_GNUTLS_CERTIFICATE_SET_X509_SYSTEM_TRUST 1
# | #define HAVE_LIBNETTLE 1
# | #define HAVE_LIBGMP 1
# | #define HAVE___GMPZ_POWM_SEC 1
# | #define HAVE_GMP_SEC 1
# | #define HAVE_LIBSSH2 1
# | #define HAVE_LIBCARES 1
# | #define HAVE_ARES_ADDR_NODE 1
# | #define HAVE_ARES_SET_SERVERS 1
# | #define USE_LIBNETTLE_MD 1
# | #define ENABLE_SSL 1
# | #define ENABLE_BITTORRENT 1
# | #define ENABLE_METALINK 1
# | #define ENABLE_XML_RPC 1
# | #define ENABLE_ASYNC_DNS 1
# | #define HAVE_ALLOCA_H 1
# | #define HAVE_ALLOCA 1
# | #define STDC_HEADERS 1
# | #define HAVE_ARGZ_H 1
# | #define HAVE_ARPA_INET_H 1
# | #define HAVE_FCNTL_H 1
# | #define HAVE_FLOAT_H 1
# | #define HAVE_INTTYPES_H 1
# | #define HAVE_LANGINFO_H 1
# | #define HAVE_LIBINTL_H 1
# | #define HAVE_LIMITS_H 1
# | #define HAVE_LOCALE_H 1
# | #define HAVE_MALLOC_H 1
# | #define HAVE_NETDB_H 1
# | #define HAVE_NETINET_IN_H 1
# | #define HAVE_NETINET_TCP_H 1
# | #define HAVE_POLL_H 1
# | #define HAVE_SIGNAL_H 1
# | #define HAVE_STDDEF_H 1
# | #define HAVE_STDINT_H 1
# | #define HAVE_STDIO_EXT_H 1
# | #define HAVE_STDLIB_H 1
# | #define HAVE_STRING_H 1
# | #define HAVE_STRINGS_H 1
# | #define HAVE_SYS_IOCTL_H 1
# | #define HAVE_SYS_PARAM_H 1
# | #define HAVE_SYS_RESOURCE_H 1
# | #define HAVE_SYS_SIGNAL_H 1
# | #define HAVE_SYS_SOCKET_H 1
# | #define HAVE_SYS_TIME_H 1
# | #define HAVE_SYS_TYPES_H 1
# | #define HAVE_SYS_UIO_H 1
# | #define HAVE_SYS_UTSNAME_H 1
# | #define HAVE_TERMIOS_H 1
# | #define HAVE_UNISTD_H 1
# | #define HAVE_UTIME_H 1
# | #define HAVE_WCHAR_H 1
# | #define HAVE_IFADDRS_H 1
# | #define HAVE_PWD_H 1
# | #define TIME_WITH_SYS_TIME 1
# | #define HAVE_PTRDIFF_T 1
# | /* end confdefs.h. */
# | #include
# | #include
# |
# | int
# | main ()
# | {
# | #if BYTE_ORDER != BIG_ENDIAN
# | not big endian
# | #endif
# |
# | ;
# | return 0;
# | }
# configure:22161: result: no
# configure:22186: checking for special C compiler options needed for large files
# configure:22231: result: no
# configure:22237: checking for _FILE_OFFSET_BITS value needed for large files
# configure:22262: g++ -c conftest.cpp >&5
# configure:22262: $? = 0
# configure:22294: result: no
# configure:22395: checking whether NLS is requested
# configure:22404: result: yes
# configure:22445: checking for msgfmt
# configure: trying /usr/bin/msgfmt...
# 0 translated messages.
# configure:22477: result: /usr/bin/msgfmt
# configure:22486: checking for gmsgfmt
# configure:22517: result: /usr/bin/msgfmt
# configure:22568: checking for xgettext
# configure: trying /usr/bin/xgettext...
# /usr/bin/xgettext: warning: file '/dev/null' extension '' is unknown; will try C
# configure:22600: result: /usr/bin/xgettext
# configure:22646: checking for msgmerge
# configure: trying /usr/bin/msgmerge...
# configure:22677: result: /usr/bin/msgmerge
# configure:22734: checking for ld used by GCC
# configure:22798: result: /usr/bin/ld -m elf_x86_64
# configure:22805: checking if the linker (/usr/bin/ld -m elf_x86_64) is GNU ld
# configure:22818: result: yes
# configure:22825: checking for shared library run path origin
# configure:22838: result: done
# configure:23410: checking for CFPreferencesCopyAppValue
# configure:23428: g++ -o conftest conftest.cpp -Wl,-framework -Wl,CoreFoundation >&5
# conftest.cpp:96:42: fatal error: CoreFoundation/CFPreferences.h: No such file or directory
# #include
# ^
# compilation terminated.
# configure:23428: $? = 1
# configure: failed program was:
# | /* confdefs.h */
# | #define PACKAGE_NAME "aria2"
# | #define PACKAGE_TARNAME "aria2"
# | #define PACKAGE_VERSION "1.24.0"
# | #define PACKAGE_STRING "aria2 1.24.0"
# | #define PACKAGE_BUGREPORT "https://github.com/aria2/aria2/issues"
# | #define PACKAGE_URL "https://aria2.github.io/"
# | #define PACKAGE "aria2"
# | #define VERSION "1.24.0"
# | #define STDC_HEADERS 1
# | #define HAVE_SYS_TYPES_H 1
# | #define HAVE_SYS_STAT_H 1
# | #define HAVE_STDLIB_H 1
# | #define HAVE_STRING_H 1
# | #define HAVE_MEMORY_H 1
# | #define HAVE_STRINGS_H 1
# | #define HAVE_INTTYPES_H 1
# | #define HAVE_STDINT_H 1
# | #define HAVE_UNISTD_H 1
# | #define __EXTENSIONS__ 1
# | #define _ALL_SOURCE 1
# | #define _GNU_SOURCE 1
# | #define _POSIX_PTHREAD_SEMANTICS 1
# | #define _TANDEM_SOURCE 1
# | #define HAVE_DLFCN_H 1
# | #define LT_OBJDIR ".libs/"
# | #define BUILD "x86_64-pc-linux-gnu"
# | #define HOST "x86_64-unknown-linux-gnu"
# | #define TARGET "x86_64-unknown-linux-gnu"
# | #define CA_BUNDLE "/etc/ssl/certs/ca-certificates.crt"
# | #define CXX11_OVERRIDE override
# | #define HAVE_ZLIB 1
# | #define HAVE_GZSETPARAMS 1
# | #define HAVE_LIBXML2 1
# | #define HAVE_SQLITE3 1
# | #define HAVE_SQLITE3_OPEN_V2 1
# | #define HAVE_LIBGNUTLS 1
# | #define HAVE_GNUTLS_CERTIFICATE_SET_X509_SYSTEM_TRUST 1
# | #define HAVE_LIBNETTLE 1
# | #define HAVE_LIBGMP 1
# | #define HAVE___GMPZ_POWM_SEC 1
# | #define HAVE_GMP_SEC 1
# | #define HAVE_LIBSSH2 1
# | #define HAVE_LIBCARES 1
# | #define HAVE_ARES_ADDR_NODE 1
# | #define HAVE_ARES_SET_SERVERS 1
# | #define USE_LIBNETTLE_MD 1
# | #define ENABLE_SSL 1
# | #define ENABLE_BITTORRENT 1
# | #define ENABLE_METALINK 1
# | #define ENABLE_XML_RPC 1
# | #define ENABLE_ASYNC_DNS 1
# | #define HAVE_ALLOCA_H 1
# | #define HAVE_ALLOCA 1
# | #define STDC_HEADERS 1
# | #define HAVE_ARGZ_H 1
# | #define HAVE_ARPA_INET_H 1
# | #define HAVE_FCNTL_H 1
# | #define HAVE_FLOAT_H 1
# | #define HAVE_INTTYPES_H 1
# | #define HAVE_LANGINFO_H 1
# | #define HAVE_LIBINTL_H 1
# | #define HAVE_LIMITS_H 1
# | #define HAVE_LOCALE_H 1
# | #define HAVE_MALLOC_H 1
# | #define HAVE_NETDB_H 1
# | #define HAVE_NETINET_IN_H 1
# | #define HAVE_NETINET_TCP_H 1
# | #define HAVE_POLL_H 1
# | #define HAVE_SIGNAL_H 1
# | #define HAVE_STDDEF_H 1
# | #define HAVE_STDINT_H 1
# | #define HAVE_STDIO_EXT_H 1
# | #define HAVE_STDLIB_H 1
# | #define HAVE_STRING_H 1
# | #define HAVE_STRINGS_H 1
# | #define HAVE_SYS_IOCTL_H 1
# | #define HAVE_SYS_PARAM_H 1
# | #define HAVE_SYS_RESOURCE_H 1
# | #define HAVE_SYS_SIGNAL_H 1
# | #define HAVE_SYS_SOCKET_H 1
# | #define HAVE_SYS_TIME_H 1
# | #define HAVE_SYS_TYPES_H 1
# | #define HAVE_SYS_UIO_H 1
# | #define HAVE_SYS_UTSNAME_H 1
# | #define HAVE_TERMIOS_H 1
# | #define HAVE_UNISTD_H 1
# | #define HAVE_UTIME_H 1
# | #define HAVE_WCHAR_H 1
# | #define HAVE_IFADDRS_H 1
# | #define HAVE_PWD_H 1
# | #define TIME_WITH_SYS_TIME 1
# | #define HAVE_PTRDIFF_T 1
# | #define HAVE_A2_STRUCT_TIMESPEC 1
# | /* end confdefs.h. */
# | #include
# | int
# | main ()
# | {
# | CFPreferencesCopyAppValue(NULL, NULL)
# | ;
# | return 0;
# | }
# configure:23437: result: no
# configure:23444: checking for CFLocaleCopyCurrent
# configure:23462: g++ -o conftest conftest.cpp -Wl,-framework -Wl,CoreFoundation >&5
# conftest.cpp:96:37: fatal error: CoreFoundation/CFLocale.h: No such file or directory
# #include
# ^
# compilation terminated.
# configure:23462: $? = 1
# configure: failed program was:
# | /* confdefs.h */
# | #define PACKAGE_NAME "aria2"
# | #define PACKAGE_TARNAME "aria2"
# | #define PACKAGE_VERSION "1.24.0"
# | #define PACKAGE_STRING "aria2 1.24.0"
# | #define PACKAGE_BUGREPORT "https://github.com/aria2/aria2/issues"
# | #define PACKAGE_URL "https://aria2.github.io/"
# | #define PACKAGE "aria2"
# | #define VERSION "1.24.0"
# | #define STDC_HEADERS 1
# | #define HAVE_SYS_TYPES_H 1
# | #define HAVE_SYS_STAT_H 1
# | #define HAVE_STDLIB_H 1
# | #define HAVE_STRING_H 1
# | #define HAVE_MEMORY_H 1
# | #define HAVE_STRINGS_H 1
# | #define HAVE_INTTYPES_H 1
# | #define HAVE_STDINT_H 1
# | #define HAVE_UNISTD_H 1
# | #define __EXTENSIONS__ 1
# | #define _ALL_SOURCE 1
# | #define _GNU_SOURCE 1
# | #define _POSIX_PTHREAD_SEMANTICS 1
# | #define _TANDEM_SOURCE 1
# | #define HAVE_DLFCN_H 1
# | #define LT_OBJDIR ".libs/"
# | #define BUILD "x86_64-pc-linux-gnu"
# | #define HOST "x86_64-unknown-linux-gnu"
# | #define TARGET "x86_64-unknown-linux-gnu"
# | #define CA_BUNDLE "/etc/ssl/certs/ca-certificates.crt"
# | #define CXX11_OVERRIDE override
# | #define HAVE_ZLIB 1
# | #define HAVE_GZSETPARAMS 1
# | #define HAVE_LIBXML2 1
# | #define HAVE_SQLITE3 1
# | #define HAVE_SQLITE3_OPEN_V2 1
# | #define HAVE_LIBGNUTLS 1
# | #define HAVE_GNUTLS_CERTIFICATE_SET_X509_SYSTEM_TRUST 1
# | #define HAVE_LIBNETTLE 1
# | #define HAVE_LIBGMP 1
# | #define HAVE___GMPZ_POWM_SEC 1
# | #define HAVE_GMP_SEC 1
# | #define HAVE_LIBSSH2 1
# | #define HAVE_LIBCARES 1
# | #define HAVE_ARES_ADDR_NODE 1
# | #define HAVE_ARES_SET_SERVERS 1
# | #define USE_LIBNETTLE_MD 1
# | #define ENABLE_SSL 1
# | #define ENABLE_BITTORRENT 1
# | #define ENABLE_METALINK 1
# | #define ENABLE_XML_RPC 1
# | #define ENABLE_ASYNC_DNS 1
# | #define HAVE_ALLOCA_H 1
# | #define HAVE_ALLOCA 1
# | #define STDC_HEADERS 1
# | #define HAVE_ARGZ_H 1
# | #define HAVE_ARPA_INET_H 1
# | #define HAVE_FCNTL_H 1
# | #define HAVE_FLOAT_H 1
# | #define HAVE_INTTYPES_H 1
# | #define HAVE_LANGINFO_H 1
# | #define HAVE_LIBINTL_H 1
# | #define HAVE_LIMITS_H 1
# | #define HAVE_LOCALE_H 1
# | #define HAVE_MALLOC_H 1
# | #define HAVE_NETDB_H 1
# | #define HAVE_NETINET_IN_H 1
# | #define HAVE_NETINET_TCP_H 1
# | #define HAVE_POLL_H 1
# | #define HAVE_SIGNAL_H 1
# | #define HAVE_STDDEF_H 1
# | #define HAVE_STDINT_H 1
# | #define HAVE_STDIO_EXT_H 1
# | #define HAVE_STDLIB_H 1
# | #define HAVE_STRING_H 1
# | #define HAVE_STRINGS_H 1
# | #define HAVE_SYS_IOCTL_H 1
# | #define HAVE_SYS_PARAM_H 1
# | #define HAVE_SYS_RESOURCE_H 1
# | #define HAVE_SYS_SIGNAL_H 1
# | #define HAVE_SYS_SOCKET_H 1
# | #define HAVE_SYS_TIME_H 1
# | #define HAVE_SYS_TYPES_H 1
# | #define HAVE_SYS_UIO_H 1
# | #define HAVE_SYS_UTSNAME_H 1
# | #define HAVE_TERMIOS_H 1
# | #define HAVE_UNISTD_H 1
# | #define HAVE_UTIME_H 1
# | #define HAVE_WCHAR_H 1
# | #define HAVE_IFADDRS_H 1
# | #define HAVE_PWD_H 1
# | #define TIME_WITH_SYS_TIME 1
# | #define HAVE_PTRDIFF_T 1
# | #define HAVE_A2_STRUCT_TIMESPEC 1
# | /* end confdefs.h. */
# | #include
# | int
# | main ()
# | {
# | CFLocaleCopyCurrent();
# | ;
# | return 0;
# | }
# configure:23471: result: no
# configure:23520: checking for GNU gettext in libc
# configure:23540: g++ -o conftest conftest.cpp >&5
# configure:23540: $? = 0
# configure:23549: result: yes
# configure:24340: checking whether to use NLS
# configure:24342: result: yes
# configure:24345: checking where the gettext function comes from
# configure:24356: result: libc
# configure:24414: checking for error_at_line
# configure:24430: g++ -o conftest conftest.cpp >&5
# configure:24430: $? = 0
# configure:24438: result: yes
# configure:24450: checking whether gcc needs -traditional
# configure:24484: result: no
# configure:24492: checking for working memcmp
# configure:24535: g++ -o conftest conftest.cpp >&5
# configure:24535: $? = 0
# configure:24535: ./conftest
# configure:24535: $? = 0
# configure:24545: result: yes
# configure:24560: checking for sys/time.h
# configure:24560: result: yes
# configure:24560: checking for unistd.h
# configure:24560: result: yes
# configure:24581: checking for alarm
# configure:24581: g++ -o conftest conftest.cpp >&5
# configure:24581: $? = 0
# configure:24581: result: yes
# configure:24594: checking for working mktime
# configure:24796: g++ -o conftest conftest.cpp >&5
# configure:24796: $? = 0
# configure:24796: ./conftest
# configure:24796: $? = 0
# configure:24806: result: yes
# configure:24820: checking sys/select.h usability
# configure:24820: g++ -c conftest.cpp >&5
# configure:24820: $? = 0
# configure:24820: result: yes
# configure:24820: checking sys/select.h presence
# configure:24820: g++ -E conftest.cpp
# configure:24820: $? = 0
# configure:24820: result: yes
# configure:24820: checking for sys/select.h
# configure:24820: result: yes
# configure:24820: checking for sys/socket.h
# configure:24820: result: yes
# configure:24830: checking types of arguments for select
# configure:24858: g++ -c conftest.cpp >&5
# configure:24858: $? = 0
# configure:24869: result: int,fd_set *,struct timeval *
# configure:24892: checking whether lstat correctly handles trailing slash
# configure:24918: g++ -o conftest conftest.cpp >&5
# configure:24918: $? = 0
# configure:24918: ./conftest
# configure:24918: $? = 0
# configure:24935: result: yes
# configure:24954: checking whether stat accepts an empty string
# configure:24974: g++ -o conftest conftest.cpp >&5
# configure:24974: $? = 0
# configure:24974: ./conftest
# configure:24974: $? = 0
# configure:24984: result: no
# configure:25002: checking for strftime
# configure:25002: g++ -o conftest conftest.cpp >&5
# configure:25002: $? = 0
# configure:25002: result: yes
# configure:25057: checking for vprintf
# configure:25057: g++ -o conftest conftest.cpp >&5
# configure:25057: $? = 0
# configure:25057: result: yes
# configure:25063: checking for _doprnt
# configure:25063: g++ -o conftest conftest.cpp >&5
# /tmp/ccQNmUYM.o: In function `main':
# conftest.cpp:(.text+0x5): undefined reference to `_doprnt'
# collect2: error: ld returned 1 exit status
# configure:25063: $? = 1
# configure: failed program was:
# | /* confdefs.h */
# | #define PACKAGE_NAME "aria2"
# | #define PACKAGE_TARNAME "aria2"
# | #define PACKAGE_VERSION "1.24.0"
# | #define PACKAGE_STRING "aria2 1.24.0"
# | #define PACKAGE_BUGREPORT "https://github.com/aria2/aria2/issues"
# | #define PACKAGE_URL "https://aria2.github.io/"
# | #define PACKAGE "aria2"
# | #define VERSION "1.24.0"
# | #define STDC_HEADERS 1
# | #define HAVE_SYS_TYPES_H 1
# | #define HAVE_SYS_STAT_H 1
# | #define HAVE_STDLIB_H 1
# | #define HAVE_STRING_H 1
# | #define HAVE_MEMORY_H 1
# | #define HAVE_STRINGS_H 1
# | #define HAVE_INTTYPES_H 1
# | #define HAVE_STDINT_H 1
# | #define HAVE_UNISTD_H 1
# | #define __EXTENSIONS__ 1
# | #define _ALL_SOURCE 1
# | #define _GNU_SOURCE 1
# | #define _POSIX_PTHREAD_SEMANTICS 1
# | #define _TANDEM_SOURCE 1
# | #define HAVE_DLFCN_H 1
# | #define LT_OBJDIR ".libs/"
# | #define BUILD "x86_64-pc-linux-gnu"
# | #define HOST "x86_64-unknown-linux-gnu"
# | #define TARGET "x86_64-unknown-linux-gnu"
# | #define CA_BUNDLE "/etc/ssl/certs/ca-certificates.crt"
# | #define CXX11_OVERRIDE override
# | #define HAVE_ZLIB 1
# | #define HAVE_GZSETPARAMS 1
# | #define HAVE_LIBXML2 1
# | #define HAVE_SQLITE3 1
# | #define HAVE_SQLITE3_OPEN_V2 1
# | #define HAVE_LIBGNUTLS 1
# | #define HAVE_GNUTLS_CERTIFICATE_SET_X509_SYSTEM_TRUST 1
# | #define HAVE_LIBNETTLE 1
# | #define HAVE_LIBGMP 1
# | #define HAVE___GMPZ_POWM_SEC 1
# | #define HAVE_GMP_SEC 1
# | #define HAVE_LIBSSH2 1
# | #define HAVE_LIBCARES 1
# | #define HAVE_ARES_ADDR_NODE 1
# | #define HAVE_ARES_SET_SERVERS 1
# | #define USE_LIBNETTLE_MD 1
# | #define ENABLE_SSL 1
# | #define ENABLE_BITTORRENT 1
# | #define ENABLE_METALINK 1
# | #define ENABLE_XML_RPC 1
# | #define ENABLE_ASYNC_DNS 1
# | #define HAVE_ALLOCA_H 1
# | #define HAVE_ALLOCA 1
# | #define STDC_HEADERS 1
# | #define HAVE_ARGZ_H 1
# | #define HAVE_ARPA_INET_H 1
# | #define HAVE_FCNTL_H 1
# | #define HAVE_FLOAT_H 1
# | #define HAVE_INTTYPES_H 1
# | #define HAVE_LANGINFO_H 1
# | #define HAVE_LIBINTL_H 1
# | #define HAVE_LIMITS_H 1
# | #define HAVE_LOCALE_H 1
# | #define HAVE_MALLOC_H 1
# | #define HAVE_NETDB_H 1
# | #define HAVE_NETINET_IN_H 1
# | #define HAVE_NETINET_TCP_H 1
# | #define HAVE_POLL_H 1
# | #define HAVE_SIGNAL_H 1
# | #define HAVE_STDDEF_H 1
# | #define HAVE_STDINT_H 1
# | #define HAVE_STDIO_EXT_H 1
# | #define HAVE_STDLIB_H 1
# | #define HAVE_STRING_H 1
# | #define HAVE_STRINGS_H 1
# | #define HAVE_SYS_IOCTL_H 1
# | #define HAVE_SYS_PARAM_H 1
# | #define HAVE_SYS_RESOURCE_H 1
# | #define HAVE_SYS_SIGNAL_H 1
# | #define HAVE_SYS_SOCKET_H 1
# | #define HAVE_SYS_TIME_H 1
# | #define HAVE_SYS_TYPES_H 1
# | #define HAVE_SYS_UIO_H 1
# | #define HAVE_SYS_UTSNAME_H 1
# | #define HAVE_TERMIOS_H 1
# | #define HAVE_UNISTD_H 1
# | #define HAVE_UTIME_H 1
# | #define HAVE_WCHAR_H 1
# | #define HAVE_IFADDRS_H 1
# | #define HAVE_PWD_H 1
# | #define TIME_WITH_SYS_TIME 1
# | #define HAVE_PTRDIFF_T 1
# | #define HAVE_A2_STRUCT_TIMESPEC 1
# | #define ENABLE_NLS 1
# | #define HAVE_GETTEXT 1
# | #define HAVE_DCGETTEXT 1
# | #define HAVE_SYS_TIME_H 1
# | #define HAVE_UNISTD_H 1
# | #define HAVE_ALARM 1
# | #define HAVE_SYS_SELECT_H 1
# | #define HAVE_SYS_SOCKET_H 1
# | #define SELECT_TYPE_ARG1 int
# | #define SELECT_TYPE_ARG234 (fd_set *)
# | #define SELECT_TYPE_ARG5 (struct timeval *)
# | #define LSTAT_FOLLOWS_SLASHED_SYMLINK 1
# | #define HAVE_STRFTIME 1
# | #define HAVE_VPRINTF 1
# | /* end confdefs.h. */
# | /* Define _doprnt to an innocuous variant, in case declares _doprnt.
# | For example, HP-UX 11i declares gettimeofday. */
# | #define _doprnt innocuous__doprnt
# |
# | /* System header to define __stub macros and hopefully few prototypes,
# | which can conflict with char _doprnt (); below.
# | Prefer to if __STDC__ is defined, since
# | exists even on freestanding compilers. */
# |
# | #ifdef __STDC__
# | # include
# | #else
# | # include
# | #endif
# |
# | #undef _doprnt
# |
# | /* Override any GCC internal prototype to avoid an error.
# | Use char because int might match the return type of a GCC
# | builtin and then its argument prototype would still apply. */
# | #ifdef __cplusplus
# | extern "C"
# | #endif
# | char _doprnt ();
# | /* The GNU C library defines this for functions which it implements
# | to always fail with ENOSYS. Some functions are actually named
# | something starting with __ and the normal name is an alias. */
# | #if defined __stub__doprnt || defined __stub____doprnt
# | choke me
# | #endif
# |
# | int
# | main ()
# | {
# | return _doprnt ();
# | ;
# | return 0;
# | }
# configure:25063: result: no
# configure:25076: checking vfork.h usability
# configure:25076: g++ -c conftest.cpp >&5
# conftest.cpp:143:19: fatal error: vfork.h: No such file or directory
# #include
# ^
# compilation terminated.
# configure:25076: $? = 1
# configure: failed program was:
# | /* confdefs.h */
# | #define PACKAGE_NAME "aria2"
# | #define PACKAGE_TARNAME "aria2"
# | #define PACKAGE_VERSION "1.24.0"
# | #define PACKAGE_STRING "aria2 1.24.0"
# | #define PACKAGE_BUGREPORT "https://github.com/aria2/aria2/issues"
# | #define PACKAGE_URL "https://aria2.github.io/"
# | #define PACKAGE "aria2"
# | #define VERSION "1.24.0"
# | #define STDC_HEADERS 1
# | #define HAVE_SYS_TYPES_H 1
# | #define HAVE_SYS_STAT_H 1
# | #define HAVE_STDLIB_H 1
# | #define HAVE_STRING_H 1
# | #define HAVE_MEMORY_H 1
# | #define HAVE_STRINGS_H 1
# | #define HAVE_INTTYPES_H 1
# | #define HAVE_STDINT_H 1
# | #define HAVE_UNISTD_H 1
# | #define __EXTENSIONS__ 1
# | #define _ALL_SOURCE 1
# | #define _GNU_SOURCE 1
# | #define _POSIX_PTHREAD_SEMANTICS 1
# | #define _TANDEM_SOURCE 1
# | #define HAVE_DLFCN_H 1
# | #define LT_OBJDIR ".libs/"
# | #define BUILD "x86_64-pc-linux-gnu"
# | #define HOST "x86_64-unknown-linux-gnu"
# | #define TARGET "x86_64-unknown-linux-gnu"
# | #define CA_BUNDLE "/etc/ssl/certs/ca-certificates.crt"
# | #define CXX11_OVERRIDE override
# | #define HAVE_ZLIB 1
# | #define HAVE_GZSETPARAMS 1
# | #define HAVE_LIBXML2 1
# | #define HAVE_SQLITE3 1
# | #define HAVE_SQLITE3_OPEN_V2 1
# | #define HAVE_LIBGNUTLS 1
# | #define HAVE_GNUTLS_CERTIFICATE_SET_X509_SYSTEM_TRUST 1
# | #define HAVE_LIBNETTLE 1
# | #define HAVE_LIBGMP 1
# | #define HAVE___GMPZ_POWM_SEC 1
# | #define HAVE_GMP_SEC 1
# | #define HAVE_LIBSSH2 1
# | #define HAVE_LIBCARES 1
# | #define HAVE_ARES_ADDR_NODE 1
# | #define HAVE_ARES_SET_SERVERS 1
# | #define USE_LIBNETTLE_MD 1
# | #define ENABLE_SSL 1
# | #define ENABLE_BITTORRENT 1
# | #define ENABLE_METALINK 1
# | #define ENABLE_XML_RPC 1
# | #define ENABLE_ASYNC_DNS 1
# | #define HAVE_ALLOCA_H 1
# | #define HAVE_ALLOCA 1
# | #define STDC_HEADERS 1
# | #define HAVE_ARGZ_H 1
# | #define HAVE_ARPA_INET_H 1
# | #define HAVE_FCNTL_H 1
# | #define HAVE_FLOAT_H 1
# | #define HAVE_INTTYPES_H 1
# | #define HAVE_LANGINFO_H 1
# | #define HAVE_LIBINTL_H 1
# | #define HAVE_LIMITS_H 1
# | #define HAVE_LOCALE_H 1
# | #define HAVE_MALLOC_H 1
# | #define HAVE_NETDB_H 1
# | #define HAVE_NETINET_IN_H 1
# | #define HAVE_NETINET_TCP_H 1
# | #define HAVE_POLL_H 1
# | #define HAVE_SIGNAL_H 1
# | #define HAVE_STDDEF_H 1
# | #define HAVE_STDINT_H 1
# | #define HAVE_STDIO_EXT_H 1
# | #define HAVE_STDLIB_H 1
# | #define HAVE_STRING_H 1
# | #define HAVE_STRINGS_H 1
# | #define HAVE_SYS_IOCTL_H 1
# | #define HAVE_SYS_PARAM_H 1
# | #define HAVE_SYS_RESOURCE_H 1
# | #define HAVE_SYS_SIGNAL_H 1
# | #define HAVE_SYS_SOCKET_H 1
# | #define HAVE_SYS_TIME_H 1
# | #define HAVE_SYS_TYPES_H 1
# | #define HAVE_SYS_UIO_H 1
# | #define HAVE_SYS_UTSNAME_H 1
# | #define HAVE_TERMIOS_H 1
# | #define HAVE_UNISTD_H 1
# | #define HAVE_UTIME_H 1
# | #define HAVE_WCHAR_H 1
# | #define HAVE_IFADDRS_H 1
# | #define HAVE_PWD_H 1
# | #define TIME_WITH_SYS_TIME 1
# | #define HAVE_PTRDIFF_T 1
# | #define HAVE_A2_STRUCT_TIMESPEC 1
# | #define ENABLE_NLS 1
# | #define HAVE_GETTEXT 1
# | #define HAVE_DCGETTEXT 1
# | #define HAVE_SYS_TIME_H 1
# | #define HAVE_UNISTD_H 1
# | #define HAVE_ALARM 1
# | #define HAVE_SYS_SELECT_H 1
# | #define HAVE_SYS_SOCKET_H 1
# | #define SELECT_TYPE_ARG1 int
# | #define SELECT_TYPE_ARG234 (fd_set *)
# | #define SELECT_TYPE_ARG5 (struct timeval *)
# | #define LSTAT_FOLLOWS_SLASHED_SYMLINK 1
# | #define HAVE_STRFTIME 1
# | #define HAVE_VPRINTF 1
# | /* end confdefs.h. */
# | #include
# | #ifdef HAVE_SYS_TYPES_H
# | # include
# | #endif
# | #ifdef HAVE_SYS_STAT_H
# | # include
# | #endif
# | #ifdef STDC_HEADERS
# | # include
# | # include
# | #else
# | # ifdef HAVE_STDLIB_H
# | # include
# | # endif
# | #endif
# | #ifdef HAVE_STRING_H
# | # if !defined STDC_HEADERS && defined HAVE_MEMORY_H
# | # include
# | # endif
# | # include
# | #endif
# | #ifdef HAVE_STRINGS_H
# | # include
# | #endif
# | #ifdef HAVE_INTTYPES_H
# | # include
# | #endif
# | #ifdef HAVE_STDINT_H
# | # include
# | #endif
# | #ifdef HAVE_UNISTD_H
# | # include
# | #endif
# | #include
# configure:25076: result: no
# configure:25076: checking vfork.h presence
# configure:25076: g++ -E conftest.cpp
# conftest.cpp:110:19: fatal error: vfork.h: No such file or directory
# #include
# ^
# compilation terminated.
# configure:25076: $? = 1
# configure: failed program was:
# | /* confdefs.h */
# | #define PACKAGE_NAME "aria2"
# | #define PACKAGE_TARNAME "aria2"
# | #define PACKAGE_VERSION "1.24.0"
# | #define PACKAGE_STRING "aria2 1.24.0"
# | #define PACKAGE_BUGREPORT "https://github.com/aria2/aria2/issues"
# | #define PACKAGE_URL "https://aria2.github.io/"
# | #define PACKAGE "aria2"
# | #define VERSION "1.24.0"
# | #define STDC_HEADERS 1
# | #define HAVE_SYS_TYPES_H 1
# | #define HAVE_SYS_STAT_H 1
# | #define HAVE_STDLIB_H 1
# | #define HAVE_STRING_H 1
# | #define HAVE_MEMORY_H 1
# | #define HAVE_STRINGS_H 1
# | #define HAVE_INTTYPES_H 1
# | #define HAVE_STDINT_H 1
# | #define HAVE_UNISTD_H 1
# | #define __EXTENSIONS__ 1
# | #define _ALL_SOURCE 1
# | #define _GNU_SOURCE 1
# | #define _POSIX_PTHREAD_SEMANTICS 1
# | #define _TANDEM_SOURCE 1
# | #define HAVE_DLFCN_H 1
# | #define LT_OBJDIR ".libs/"
# | #define BUILD "x86_64-pc-linux-gnu"
# | #define HOST "x86_64-unknown-linux-gnu"
# | #define TARGET "x86_64-unknown-linux-gnu"
# | #define CA_BUNDLE "/etc/ssl/certs/ca-certificates.crt"
# | #define CXX11_OVERRIDE override
# | #define HAVE_ZLIB 1
# | #define HAVE_GZSETPARAMS 1
# | #define HAVE_LIBXML2 1
# | #define HAVE_SQLITE3 1
# | #define HAVE_SQLITE3_OPEN_V2 1
# | #define HAVE_LIBGNUTLS 1
# | #define HAVE_GNUTLS_CERTIFICATE_SET_X509_SYSTEM_TRUST 1
# | #define HAVE_LIBNETTLE 1
# | #define HAVE_LIBGMP 1
# | #define HAVE___GMPZ_POWM_SEC 1
# | #define HAVE_GMP_SEC 1
# | #define HAVE_LIBSSH2 1
# | #define HAVE_LIBCARES 1
# | #define HAVE_ARES_ADDR_NODE 1
# | #define HAVE_ARES_SET_SERVERS 1
# | #define USE_LIBNETTLE_MD 1
# | #define ENABLE_SSL 1
# | #define ENABLE_BITTORRENT 1
# | #define ENABLE_METALINK 1
# | #define ENABLE_XML_RPC 1
# | #define ENABLE_ASYNC_DNS 1
# | #define HAVE_ALLOCA_H 1
# | #define HAVE_ALLOCA 1
# | #define STDC_HEADERS 1
# | #define HAVE_ARGZ_H 1
# | #define HAVE_ARPA_INET_H 1
# | #define HAVE_FCNTL_H 1
# | #define HAVE_FLOAT_H 1
# | #define HAVE_INTTYPES_H 1
# | #define HAVE_LANGINFO_H 1
# | #define HAVE_LIBINTL_H 1
# | #define HAVE_LIMITS_H 1
# | #define HAVE_LOCALE_H 1
# | #define HAVE_MALLOC_H 1
# | #define HAVE_NETDB_H 1
# | #define HAVE_NETINET_IN_H 1
# | #define HAVE_NETINET_TCP_H 1
# | #define HAVE_POLL_H 1
# | #define HAVE_SIGNAL_H 1
# | #define HAVE_STDDEF_H 1
# | #define HAVE_STDINT_H 1
# | #define HAVE_STDIO_EXT_H 1
# | #define HAVE_STDLIB_H 1
# | #define HAVE_STRING_H 1
# | #define HAVE_STRINGS_H 1
# | #define HAVE_SYS_IOCTL_H 1
# | #define HAVE_SYS_PARAM_H 1
# | #define HAVE_SYS_RESOURCE_H 1
# | #define HAVE_SYS_SIGNAL_H 1
# | #define HAVE_SYS_SOCKET_H 1
# | #define HAVE_SYS_TIME_H 1
# | #define HAVE_SYS_TYPES_H 1
# | #define HAVE_SYS_UIO_H 1
# | #define HAVE_SYS_UTSNAME_H 1
# | #define HAVE_TERMIOS_H 1
# | #define HAVE_UNISTD_H 1
# | #define HAVE_UTIME_H 1
# | #define HAVE_WCHAR_H 1
# | #define HAVE_IFADDRS_H 1
# | #define HAVE_PWD_H 1
# | #define TIME_WITH_SYS_TIME 1
# | #define HAVE_PTRDIFF_T 1
# | #define HAVE_A2_STRUCT_TIMESPEC 1
# | #define ENABLE_NLS 1
# | #define HAVE_GETTEXT 1
# | #define HAVE_DCGETTEXT 1
# | #define HAVE_SYS_TIME_H 1
# | #define HAVE_UNISTD_H 1
# | #define HAVE_ALARM 1
# | #define HAVE_SYS_SELECT_H 1
# | #define HAVE_SYS_SOCKET_H 1
# | #define SELECT_TYPE_ARG1 int
# | #define SELECT_TYPE_ARG234 (fd_set *)
# | #define SELECT_TYPE_ARG5 (struct timeval *)
# | #define LSTAT_FOLLOWS_SLASHED_SYMLINK 1
# | #define HAVE_STRFTIME 1
# | #define HAVE_VPRINTF 1
# | /* end confdefs.h. */
# | #include
# configure:25076: result: no
# configure:25076: checking for vfork.h
# configure:25076: result: no
# configure:25089: checking for fork
# configure:25089: g++ -o conftest conftest.cpp >&5
# configure:25089: $? = 0
# configure:25089: result: yes
# configure:25089: checking for vfork
# configure:25089: g++ -o conftest conftest.cpp >&5
# configure:25089: $? = 0
# configure:25089: result: yes
# configure:25099: checking for working fork
# configure:25121: g++ -o conftest conftest.cpp >&5
# configure:25121: $? = 0
# configure:25121: ./conftest
# configure:25121: $? = 0
# configure:25131: result: yes
# configure:25152: checking for working vfork
# configure:25262: result: yes
# configure:25287: checking for working strtod
# configure:25328: g++ -o conftest conftest.cpp >&5
# conftest.cpp: In function 'int main()':
# conftest.cpp:156:20: warning: ISO C++ forbids converting a string constant to 'char*' [-Wwrite-strings]
# char *string = " +69";
# ^~~~~~
# conftest.cpp:167:20: warning: ISO C++ forbids converting a string constant to 'char*' [-Wwrite-strings]
# char *string = "NaN";
# ^~~~~
# configure:25328: $? = 0
# configure:25328: ./conftest
# configure:25328: $? = 0
# configure:25338: result: yes
# configure:25450: checking for __argz_count
# configure:25450: g++ -o conftest conftest.cpp >&5
# configure:25450: $? = 0
# configure:25450: result: yes
# configure:25450: checking for __argz_next
# configure:25450: g++ -o conftest conftest.cpp >&5
# configure:25450: $? = 0
# configure:25450: result: yes
# configure:25450: checking for __argz_stringify
# configure:25450: g++ -o conftest conftest.cpp >&5
# configure:25450: $? = 0
# configure:25450: result: yes
# configure:25450: checking for atexit
# configure:25450: g++ -o conftest conftest.cpp >&5
# configure:25450: $? = 0
# configure:25450: result: yes
# configure:25450: checking for ftruncate
# configure:25450: g++ -o conftest conftest.cpp >&5
# configure:25450: $? = 0
# configure:25450: result: yes
# configure:25450: checking for getcwd
# configure:25450: g++ -o conftest conftest.cpp >&5
# configure:25450: $? = 0
# configure:25450: result: yes
# configure:25450: checking for gethostbyaddr
# configure:25450: g++ -o conftest conftest.cpp >&5
# configure:25450: $? = 0
# configure:25450: result: yes
# configure:25450: checking for gethostbyname
# configure:25450: g++ -o conftest conftest.cpp >&5
# configure:25450: $? = 0
# configure:25450: result: yes
# configure:25450: checking for getifaddrs
# configure:25450: g++ -o conftest conftest.cpp >&5
# configure:25450: $? = 0
# configure:25450: result: yes
# configure:25450: checking for getpagesize
# configure:25450: g++ -o conftest conftest.cpp >&5
# configure:25450: $? = 0
# configure:25450: result: yes
# configure:25450: checking for getrandom
# configure:25450: g++ -o conftest conftest.cpp >&5
# /tmp/ccYr8jcY.o: In function `main':
# conftest.cpp:(.text+0x5): undefined reference to `getrandom'
# collect2: error: ld returned 1 exit status
# configure:25450: $? = 1
# configure: failed program was:
# | /* confdefs.h */
# | #define PACKAGE_NAME "aria2"
# | #define PACKAGE_TARNAME "aria2"
# | #define PACKAGE_VERSION "1.24.0"
# | #define PACKAGE_STRING "aria2 1.24.0"
# | #define PACKAGE_BUGREPORT "https://github.com/aria2/aria2/issues"
# | #define PACKAGE_URL "https://aria2.github.io/"
# | #define PACKAGE "aria2"
# | #define VERSION "1.24.0"
# | #define STDC_HEADERS 1
# | #define HAVE_SYS_TYPES_H 1
# | #define HAVE_SYS_STAT_H 1
# | #define HAVE_STDLIB_H 1
# | #define HAVE_STRING_H 1
# | #define HAVE_MEMORY_H 1
# | #define HAVE_STRINGS_H 1
# | #define HAVE_INTTYPES_H 1
# | #define HAVE_STDINT_H 1
# | #define HAVE_UNISTD_H 1
# | #define __EXTENSIONS__ 1
# | #define _ALL_SOURCE 1
# | #define _GNU_SOURCE 1
# | #define _POSIX_PTHREAD_SEMANTICS 1
# | #define _TANDEM_SOURCE 1
# | #define HAVE_DLFCN_H 1
# | #define LT_OBJDIR ".libs/"
# | #define BUILD "x86_64-pc-linux-gnu"
# | #define HOST "x86_64-unknown-linux-gnu"
# | #define TARGET "x86_64-unknown-linux-gnu"
# | #define CA_BUNDLE "/etc/ssl/certs/ca-certificates.crt"
# | #define CXX11_OVERRIDE override
# | #define HAVE_ZLIB 1
# | #define HAVE_GZSETPARAMS 1
# | #define HAVE_LIBXML2 1
# | #define HAVE_SQLITE3 1
# | #define HAVE_SQLITE3_OPEN_V2 1
# | #define HAVE_LIBGNUTLS 1
# | #define HAVE_GNUTLS_CERTIFICATE_SET_X509_SYSTEM_TRUST 1
# | #define HAVE_LIBNETTLE 1
# | #define HAVE_LIBGMP 1
# | #define HAVE___GMPZ_POWM_SEC 1
# | #define HAVE_GMP_SEC 1
# | #define HAVE_LIBSSH2 1
# | #define HAVE_LIBCARES 1
# | #define HAVE_ARES_ADDR_NODE 1
# | #define HAVE_ARES_SET_SERVERS 1
# | #define USE_LIBNETTLE_MD 1
# | #define ENABLE_SSL 1
# | #define ENABLE_BITTORRENT 1
# | #define ENABLE_METALINK 1
# | #define ENABLE_XML_RPC 1
# | #define ENABLE_ASYNC_DNS 1
# | #define HAVE_ALLOCA_H 1
# | #define HAVE_ALLOCA 1
# | #define STDC_HEADERS 1
# | #define HAVE_ARGZ_H 1
# | #define HAVE_ARPA_INET_H 1
# | #define HAVE_FCNTL_H 1
# | #define HAVE_FLOAT_H 1
# | #define HAVE_INTTYPES_H 1
# | #define HAVE_LANGINFO_H 1
# | #define HAVE_LIBINTL_H 1
# | #define HAVE_LIMITS_H 1
# | #define HAVE_LOCALE_H 1
# | #define HAVE_MALLOC_H 1
# | #define HAVE_NETDB_H 1
# | #define HAVE_NETINET_IN_H 1
# | #define HAVE_NETINET_TCP_H 1
# | #define HAVE_POLL_H 1
# | #define HAVE_SIGNAL_H 1
# | #define HAVE_STDDEF_H 1
# | #define HAVE_STDINT_H 1
# | #define HAVE_STDIO_EXT_H 1
# | #define HAVE_STDLIB_H 1
# | #define HAVE_STRING_H 1
# | #define HAVE_STRINGS_H 1
# | #define HAVE_SYS_IOCTL_H 1
# | #define HAVE_SYS_PARAM_H 1
# | #define HAVE_SYS_RESOURCE_H 1
# | #define HAVE_SYS_SIGNAL_H 1
# | #define HAVE_SYS_SOCKET_H 1
# | #define HAVE_SYS_TIME_H 1
# | #define HAVE_SYS_TYPES_H 1
# | #define HAVE_SYS_UIO_H 1
# | #define HAVE_SYS_UTSNAME_H 1
# | #define HAVE_TERMIOS_H 1
# | #define HAVE_UNISTD_H 1
# | #define HAVE_UTIME_H 1
# | #define HAVE_WCHAR_H 1
# | #define HAVE_IFADDRS_H 1
# | #define HAVE_PWD_H 1
# | #define TIME_WITH_SYS_TIME 1
# | #define HAVE_PTRDIFF_T 1
# | #define HAVE_A2_STRUCT_TIMESPEC 1
# | #define ENABLE_NLS 1
# | #define HAVE_GETTEXT 1
# | #define HAVE_DCGETTEXT 1
# | #define HAVE_SYS_TIME_H 1
# | #define HAVE_UNISTD_H 1
# | #define HAVE_ALARM 1
# | #define HAVE_SYS_SELECT_H 1
# | #define HAVE_SYS_SOCKET_H 1
# | #define SELECT_TYPE_ARG1 int
# | #define SELECT_TYPE_ARG234 (fd_set *)
# | #define SELECT_TYPE_ARG5 (struct timeval *)
# | #define LSTAT_FOLLOWS_SLASHED_SYMLINK 1
# | #define HAVE_STRFTIME 1
# | #define HAVE_VPRINTF 1
# | #define HAVE_FORK 1
# | #define HAVE_VFORK 1
# | #define HAVE_WORKING_VFORK 1
# | #define HAVE_WORKING_FORK 1
# | #define HAVE___ARGZ_COUNT 1
# | #define HAVE___ARGZ_NEXT 1
# | #define HAVE___ARGZ_STRINGIFY 1
# | #define HAVE_ATEXIT 1
# | #define HAVE_FTRUNCATE 1
# | #define HAVE_GETCWD 1
# | #define HAVE_GETHOSTBYADDR 1
# | #define HAVE_GETHOSTBYNAME 1
# | #define HAVE_GETIFADDRS 1
# | #define HAVE_GETPAGESIZE 1
# | /* end confdefs.h. */
# | /* Define getrandom to an innocuous variant, in case declares getrandom.
# | For example, HP-UX 11i declares gettimeofday. */
# | #define getrandom innocuous_getrandom
# |
# | /* System header to define __stub macros and hopefully few prototypes,
# | which can conflict with char getrandom (); below.
# | Prefer to if __STDC__ is defined, since
# | exists even on freestanding compilers. */
# |
# | #ifdef __STDC__
# | # include
# | #else
# | # include
# | #endif
# |
# | #undef getrandom
# |
# | /* Override any GCC internal prototype to avoid an error.
# | Use char because int might match the return type of a GCC
# | builtin and then its argument prototype would still apply. */
# | #ifdef __cplusplus
# | extern "C"
# | #endif
# | char getrandom ();
# | /* The GNU C library defines this for functions which it implements
# | to always fail with ENOSYS. Some functions are actually named
# | something starting with __ and the normal name is an alias. */
# | #if defined __stub_getrandom || defined __stub___getrandom
# | choke me
# | #endif
# |
# | int
# | main ()
# | {
# | return getrandom ();
# | ;
# | return 0;
# | }
# configure:25450: result: no
# configure:25450: checking for memchr
# configure:25450: g++ -o conftest conftest.cpp >&5
# configure:25450: $? = 0
# configure:25450: result: yes
# configure:25450: checking for memmove
# configure:25450: g++ -o conftest conftest.cpp >&5
# configure:25450: $? = 0
# configure:25450: result: yes
# configure:25450: checking for mempcpy
# configure:25450: g++ -o conftest conftest.cpp >&5
# configure:25450: $? = 0
# configure:25450: result: yes
# configure:25450: checking for memset
# configure:25450: g++ -o conftest conftest.cpp >&5
# configure:25450: $? = 0
# configure:25450: result: yes
# configure:25450: checking for mkdir
# configure:25450: g++ -o conftest conftest.cpp >&5
# configure:25450: $? = 0
# configure:25450: result: yes
# configure:25450: checking for mmap
# configure:25450: g++ -o conftest conftest.cpp >&5
# configure:25450: $? = 0
# configure:25450: result: yes
# configure:25450: checking for munmap
# configure:25450: g++ -o conftest conftest.cpp >&5
# configure:25450: $? = 0
# configure:25450: result: yes
# configure:25450: checking for nl_langinfo
# configure:25450: g++ -o conftest conftest.cpp >&5
# configure:25450: $? = 0
# configure:25450: result: yes
# configure:25450: checking for posix_fadvise
# configure:25450: g++ -o conftest conftest.cpp >&5
# configure:25450: $? = 0
# configure:25450: result: yes
# configure:25450: checking for posix_memalign
# configure:25450: g++ -o conftest conftest.cpp >&5
# configure:25450: $? = 0
# configure:25450: result: yes
# configure:25450: checking for pow
# configure:25450: g++ -o conftest conftest.cpp >&5
# configure:25450: $? = 0
# configure:25450: result: yes
# configure:25450: checking for putenv
# configure:25450: g++ -o conftest conftest.cpp >&5
# configure:25450: $? = 0
# configure:25450: result: yes
# configure:25450: checking for rmdir
# configure:25450: g++ -o conftest conftest.cpp >&5
# configure:25450: $? = 0
# configure:25450: result: yes
# configure:25450: checking for select
# configure:25450: g++ -o conftest conftest.cpp >&5
# configure:25450: $? = 0
# configure:25450: result: yes
# configure:25450: checking for setlocale
# configure:25450: g++ -o conftest conftest.cpp >&5
# configure:25450: $? = 0
# configure:25450: result: yes
# configure:25450: checking for sigaction
# configure:25450: g++ -o conftest conftest.cpp >&5
# configure:25450: $? = 0
# configure:25450: result: yes
# configure:25450: checking for sleep
# configure:25450: g++ -o conftest conftest.cpp >&5
# configure:25450: $? = 0
# configure:25450: result: yes
# configure:25450: checking for socket
# configure:25450: g++ -o conftest conftest.cpp >&5
# configure:25450: $? = 0
# configure:25450: result: yes
# configure:25450: checking for stpcpy
# configure:25450: g++ -o conftest conftest.cpp >&5
# configure:25450: $? = 0
# configure:25450: result: yes
# configure:25450: checking for strcasecmp
# configure:25450: g++ -o conftest conftest.cpp >&5
# configure:25450: $? = 0
# configure:25450: result: yes
# configure:25450: checking for strchr
# configure:25450: g++ -o conftest conftest.cpp >&5
# configure:25450: $? = 0
# configure:25450: result: yes
# configure:25450: checking for strcspn
# configure:25450: g++ -o conftest conftest.cpp >&5
# configure:25450: $? = 0
# configure:25450: result: yes
# configure:25450: checking for strdup
# configure:25450: g++ -o conftest conftest.cpp >&5
# configure:25450: $? = 0
# configure:25450: result: yes
# configure:25450: checking for strerror
# configure:25450: g++ -o conftest conftest.cpp >&5
# configure:25450: $? = 0
# configure:25450: result: yes
# configure:25450: checking for strncasecmp
# configure:25450: g++ -o conftest conftest.cpp >&5
# configure:25450: $? = 0
# configure:25450: result: yes
# configure:25450: checking for strstr
# configure:25450: g++ -o conftest conftest.cpp >&5
# configure:25450: $? = 0
# configure:25450: result: yes
# configure:25450: checking for strtol
# configure:25450: g++ -o conftest conftest.cpp >&5
# configure:25450: $? = 0
# configure:25450: result: yes
# configure:25450: checking for strtoul
# configure:25450: g++ -o conftest conftest.cpp >&5
# configure:25450: $? = 0
# configure:25450: result: yes
# configure:25450: checking for strtoull
# configure:25450: g++ -o conftest conftest.cpp >&5
# configure:25450: $? = 0
# configure:25450: result: yes
# configure:25450: checking for tzset
# configure:25450: g++ -o conftest conftest.cpp >&5
# configure:25450: $? = 0
# configure:25450: result: yes
# configure:25450: checking for unsetenv
# configure:25450: g++ -o conftest conftest.cpp >&5
# configure:25450: $? = 0
# configure:25450: result: yes
# configure:25450: checking for usleep
# configure:25450: g++ -o conftest conftest.cpp >&5
# configure:25450: $? = 0
# configure:25450: result: yes
# configure:25450: checking for utime
# configure:25450: g++ -o conftest conftest.cpp >&5
# configure:25450: $? = 0
# configure:25450: result: yes
# configure:25450: checking for utimes
# configure:25450: g++ -o conftest conftest.cpp >&5
# configure:25450: $? = 0
# configure:25450: result: yes
# configure:25460: checking for getrandom linux syscall interface
# configure:25479: g++ -o conftest conftest.cpp >&5
# configure:25479: $? = 0
# configure:25489: result: yes
# configure:25776: checking for epoll_create
# configure:25776: g++ -o conftest conftest.cpp >&5
# configure:25776: $? = 0
# configure:25776: result: yes
# configure:25802: checking for posix_fallocate
# configure:25802: g++ -o conftest conftest.cpp >&5
# configure:25802: $? = 0
# configure:25802: result: yes
# configure:25812: checking for fallocate
# configure:25829: g++ -c conftest.cpp >&5
# configure:25829: $? = 0
# configure:25835: result: yes
# configure:25864: checking for asctime_r
# configure:25882: g++ -o conftest conftest.cpp >&5
# configure:25882: $? = 0
# configure:25891: result: yes
# configure:25911: checking for localtime_r
# configure:25929: g++ -o conftest conftest.cpp >&5
# configure:25929: $? = 0
# configure:25938: result: yes
# configure:25961: checking for basename
# configure:25961: g++ -o conftest conftest.cpp >&5
# configure:25961: $? = 0
# configure:25961: result: yes
# configure:25988: checking for gai_strerror
# configure:25988: g++ -o conftest conftest.cpp >&5
# configure:25988: $? = 0
# configure:25988: result: yes
# configure:26015: checking for getaddrinfo
# configure:26015: g++ -o conftest conftest.cpp >&5
# configure:26015: $? = 0
# configure:26015: result: yes
# configure:26042: checking for gettimeofday
# configure:26042: g++ -o conftest conftest.cpp >&5
# configure:26042: $? = 0
# configure:26042: result: yes
# configure:26069: checking for strptime
# configure:26069: g++ -o conftest conftest.cpp >&5
# configure:26069: $? = 0
# configure:26069: result: yes
# configure:26096: checking for timegm
# configure:26096: g++ -o conftest conftest.cpp >&5
# configure:26096: $? = 0
# configure:26096: result: yes
# configure:26123: checking for daemon
# configure:26123: g++ -o conftest conftest.cpp >&5
# configure:26123: $? = 0
# configure:26123: result: yes
# configure:26143: checking for poll
# configure:26143: g++ -o conftest conftest.cpp >&5
# configure:26143: $? = 0
# configure:26143: result: yes
# configure:26202: checking for port_associate
# configure:26202: g++ -o conftest conftest.cpp >&5
# /tmp/cc52gXgE.o: In function `main':
# conftest.cpp:(.text+0x5): undefined reference to `port_associate'
# collect2: error: ld returned 1 exit status
# configure:26202: $? = 1
# configure: failed program was:
# | /* confdefs.h */
# | #define PACKAGE_NAME "aria2"
# | #define PACKAGE_TARNAME "aria2"
# | #define PACKAGE_VERSION "1.24.0"
# | #define PACKAGE_STRING "aria2 1.24.0"
# | #define PACKAGE_BUGREPORT "https://github.com/aria2/aria2/issues"
# | #define PACKAGE_URL "https://aria2.github.io/"
# | #define PACKAGE "aria2"
# | #define VERSION "1.24.0"
# | #define STDC_HEADERS 1
# | #define HAVE_SYS_TYPES_H 1
# | #define HAVE_SYS_STAT_H 1
# | #define HAVE_STDLIB_H 1
# | #define HAVE_STRING_H 1
# | #define HAVE_MEMORY_H 1
# | #define HAVE_STRINGS_H 1
# | #define HAVE_INTTYPES_H 1
# | #define HAVE_STDINT_H 1
# | #define HAVE_UNISTD_H 1
# | #define __EXTENSIONS__ 1
# | #define _ALL_SOURCE 1
# | #define _GNU_SOURCE 1
# | #define _POSIX_PTHREAD_SEMANTICS 1
# | #define _TANDEM_SOURCE 1
# | #define HAVE_DLFCN_H 1
# | #define LT_OBJDIR ".libs/"
# | #define BUILD "x86_64-pc-linux-gnu"
# | #define HOST "x86_64-unknown-linux-gnu"
# | #define TARGET "x86_64-unknown-linux-gnu"
# | #define CA_BUNDLE "/etc/ssl/certs/ca-certificates.crt"
# | #define CXX11_OVERRIDE override
# | #define HAVE_ZLIB 1
# | #define HAVE_GZSETPARAMS 1
# | #define HAVE_LIBXML2 1
# | #define HAVE_SQLITE3 1
# | #define HAVE_SQLITE3_OPEN_V2 1
# | #define HAVE_LIBGNUTLS 1
# | #define HAVE_GNUTLS_CERTIFICATE_SET_X509_SYSTEM_TRUST 1
# | #define HAVE_LIBNETTLE 1
# | #define HAVE_LIBGMP 1
# | #define HAVE___GMPZ_POWM_SEC 1
# | #define HAVE_GMP_SEC 1
# | #define HAVE_LIBSSH2 1
# | #define HAVE_LIBCARES 1
# | #define HAVE_ARES_ADDR_NODE 1
# | #define HAVE_ARES_SET_SERVERS 1
# | #define USE_LIBNETTLE_MD 1
# | #define ENABLE_SSL 1
# | #define ENABLE_BITTORRENT 1
# | #define ENABLE_METALINK 1
# | #define ENABLE_XML_RPC 1
# | #define ENABLE_ASYNC_DNS 1
# | #define HAVE_ALLOCA_H 1
# | #define HAVE_ALLOCA 1
# | #define STDC_HEADERS 1
# | #define HAVE_ARGZ_H 1
# | #define HAVE_ARPA_INET_H 1
# | #define HAVE_FCNTL_H 1
# | #define HAVE_FLOAT_H 1
# | #define HAVE_INTTYPES_H 1
# | #define HAVE_LANGINFO_H 1
# | #define HAVE_LIBINTL_H 1
# | #define HAVE_LIMITS_H 1
# | #define HAVE_LOCALE_H 1
# | #define HAVE_MALLOC_H 1
# | #define HAVE_NETDB_H 1
# | #define HAVE_NETINET_IN_H 1
# | #define HAVE_NETINET_TCP_H 1
# | #define HAVE_POLL_H 1
# | #define HAVE_SIGNAL_H 1
# | #define HAVE_STDDEF_H 1
# | #define HAVE_STDINT_H 1
# | #define HAVE_STDIO_EXT_H 1
# | #define HAVE_STDLIB_H 1
# | #define HAVE_STRING_H 1
# | #define HAVE_STRINGS_H 1
# | #define HAVE_SYS_IOCTL_H 1
# | #define HAVE_SYS_PARAM_H 1
# | #define HAVE_SYS_RESOURCE_H 1
# | #define HAVE_SYS_SIGNAL_H 1
# | #define HAVE_SYS_SOCKET_H 1
# | #define HAVE_SYS_TIME_H 1
# | #define HAVE_SYS_TYPES_H 1
# | #define HAVE_SYS_UIO_H 1
# | #define HAVE_SYS_UTSNAME_H 1
# | #define HAVE_TERMIOS_H 1
# | #define HAVE_UNISTD_H 1
# | #define HAVE_UTIME_H 1
# | #define HAVE_WCHAR_H 1
# | #define HAVE_IFADDRS_H 1
# | #define HAVE_PWD_H 1
# | #define TIME_WITH_SYS_TIME 1
# | #define HAVE_PTRDIFF_T 1
# | #define HAVE_A2_STRUCT_TIMESPEC 1
# | #define ENABLE_NLS 1
# | #define HAVE_GETTEXT 1
# | #define HAVE_DCGETTEXT 1
# | #define HAVE_SYS_TIME_H 1
# | #define HAVE_UNISTD_H 1
# | #define HAVE_ALARM 1
# | #define HAVE_SYS_SELECT_H 1
# | #define HAVE_SYS_SOCKET_H 1
# | #define SELECT_TYPE_ARG1 int
# | #define SELECT_TYPE_ARG234 (fd_set *)
# | #define SELECT_TYPE_ARG5 (struct timeval *)
# | #define LSTAT_FOLLOWS_SLASHED_SYMLINK 1
# | #define HAVE_STRFTIME 1
# | #define HAVE_VPRINTF 1
# | #define HAVE_FORK 1
# | #define HAVE_VFORK 1
# | #define HAVE_WORKING_VFORK 1
# | #define HAVE_WORKING_FORK 1
# | #define HAVE___ARGZ_COUNT 1
# | #define HAVE___ARGZ_NEXT 1
# | #define HAVE___ARGZ_STRINGIFY 1
# | #define HAVE_ATEXIT 1
# | #define HAVE_FTRUNCATE 1
# | #define HAVE_GETCWD 1
# | #define HAVE_GETHOSTBYADDR 1
# | #define HAVE_GETHOSTBYNAME 1
# | #define HAVE_GETIFADDRS 1
# | #define HAVE_GETPAGESIZE 1
# | #define HAVE_MEMCHR 1
# | #define HAVE_MEMMOVE 1
# | #define HAVE_MEMPCPY 1
# | #define HAVE_MEMSET 1
# | #define HAVE_MKDIR 1
# | #define HAVE_MMAP 1
# | #define HAVE_MUNMAP 1
# | #define HAVE_NL_LANGINFO 1
# | #define HAVE_POSIX_FADVISE 1
# | #define HAVE_POSIX_MEMALIGN 1
# | #define HAVE_POW 1
# | #define HAVE_PUTENV 1
# | #define HAVE_RMDIR 1
# | #define HAVE_SELECT 1
# | #define HAVE_SETLOCALE 1
# | #define HAVE_SIGACTION 1
# | #define HAVE_SLEEP 1
# | #define HAVE_SOCKET 1
# | #define HAVE_STPCPY 1
# | #define HAVE_STRCASECMP 1
# | #define HAVE_STRCHR 1
# | #define HAVE_STRCSPN 1
# | #define HAVE_STRDUP 1
# | #define HAVE_STRERROR 1
# | #define HAVE_STRNCASECMP 1
# | #define HAVE_STRSTR 1
# | #define HAVE_STRTOL 1
# | #define HAVE_STRTOUL 1
# | #define HAVE_STRTOULL 1
# | #define HAVE_TZSET 1
# | #define HAVE_UNSETENV 1
# | #define HAVE_USLEEP 1
# | #define HAVE_UTIME 1
# | #define HAVE_UTIMES 1
# | #define HAVE_GETRANDOM_INTERFACE 1
# | #define HAVE_EPOLL_CREATE 1
# | #define HAVE_EPOLL 1
# | #define HAVE_POSIX_FALLOCATE 1
# | #define HAVE_FALLOCATE 1
# | #define HAVE_SOME_FALLOCATE 1
# | #define HAVE_ASCTIME_R 1
# | #define HAVE_LOCALTIME_R 1
# | #define HAVE_BASENAME 1
# | #define HAVE_GAI_STRERROR 1
# | #define HAVE_GETADDRINFO 1
# | #define HAVE_GETTIMEOFDAY 1
# | #define HAVE_STRPTIME 1
# | #define HAVE_TIMEGM 1
# | #define HAVE_DAEMON 1
# | #define HAVE_POLL 1
# | /* end confdefs.h. */
# | /* Define port_associate to an innocuous variant, in case declares port_associate.
# | For example, HP-UX 11i declares gettimeofday. */
# | #define port_associate innocuous_port_associate
# |
# | /* System header to define __stub macros and hopefully few prototypes,
# | which can conflict with char port_associate (); below.
# | Prefer to if __STDC__ is defined, since
# | exists even on freestanding compilers. */
# |
# | #ifdef __STDC__
# | # include
# | #else
# | # include
# | #endif
# |
# | #undef port_associate
# |
# | /* Override any GCC internal prototype to avoid an error.
# | Use char because int might match the return type of a GCC
# | builtin and then its argument prototype would still apply. */
# | #ifdef __cplusplus
# | extern "C"
# | #endif
# | char port_associate ();
# | /* The GNU C library defines this for functions which it implements
# | to always fail with ENOSYS. Some functions are actually named
# | something starting with __ and the normal name is an alias. */
# | #if defined __stub_port_associate || defined __stub___port_associate
# | choke me
# | #endif
# |
# | int
# | main ()
# | {
# | return port_associate ();
# | ;
# | return 0;
# | }
# configure:26202: result: no
# configure:26222: checking for kqueue
# configure:26222: g++ -o conftest conftest.cpp >&5
# /tmp/ccII7xOJ.o: In function `main':
# conftest.cpp:(.text+0x5): undefined reference to `kqueue'
# collect2: error: ld returned 1 exit status
# configure:26222: $? = 1
# configure: failed program was:
# | /* confdefs.h */
# | #define PACKAGE_NAME "aria2"
# | #define PACKAGE_TARNAME "aria2"
# | #define PACKAGE_VERSION "1.24.0"
# | #define PACKAGE_STRING "aria2 1.24.0"
# | #define PACKAGE_BUGREPORT "https://github.com/aria2/aria2/issues"
# | #define PACKAGE_URL "https://aria2.github.io/"
# | #define PACKAGE "aria2"
# | #define VERSION "1.24.0"
# | #define STDC_HEADERS 1
# | #define HAVE_SYS_TYPES_H 1
# | #define HAVE_SYS_STAT_H 1
# | #define HAVE_STDLIB_H 1
# | #define HAVE_STRING_H 1
# | #define HAVE_MEMORY_H 1
# | #define HAVE_STRINGS_H 1
# | #define HAVE_INTTYPES_H 1
# | #define HAVE_STDINT_H 1
# | #define HAVE_UNISTD_H 1
# | #define __EXTENSIONS__ 1
# | #define _ALL_SOURCE 1
# | #define _GNU_SOURCE 1
# | #define _POSIX_PTHREAD_SEMANTICS 1
# | #define _TANDEM_SOURCE 1
# | #define HAVE_DLFCN_H 1
# | #define LT_OBJDIR ".libs/"
# | #define BUILD "x86_64-pc-linux-gnu"
# | #define HOST "x86_64-unknown-linux-gnu"
# | #define TARGET "x86_64-unknown-linux-gnu"
# | #define CA_BUNDLE "/etc/ssl/certs/ca-certificates.crt"
# | #define CXX11_OVERRIDE override
# | #define HAVE_ZLIB 1
# | #define HAVE_GZSETPARAMS 1
# | #define HAVE_LIBXML2 1
# | #define HAVE_SQLITE3 1
# | #define HAVE_SQLITE3_OPEN_V2 1
# | #define HAVE_LIBGNUTLS 1
# | #define HAVE_GNUTLS_CERTIFICATE_SET_X509_SYSTEM_TRUST 1
# | #define HAVE_LIBNETTLE 1
# | #define HAVE_LIBGMP 1
# | #define HAVE___GMPZ_POWM_SEC 1
# | #define HAVE_GMP_SEC 1
# | #define HAVE_LIBSSH2 1
# | #define HAVE_LIBCARES 1
# | #define HAVE_ARES_ADDR_NODE 1
# | #define HAVE_ARES_SET_SERVERS 1
# | #define USE_LIBNETTLE_MD 1
# | #define ENABLE_SSL 1
# | #define ENABLE_BITTORRENT 1
# | #define ENABLE_METALINK 1
# | #define ENABLE_XML_RPC 1
# | #define ENABLE_ASYNC_DNS 1
# | #define HAVE_ALLOCA_H 1
# | #define HAVE_ALLOCA 1
# | #define STDC_HEADERS 1
# | #define HAVE_ARGZ_H 1
# | #define HAVE_ARPA_INET_H 1
# | #define HAVE_FCNTL_H 1
# | #define HAVE_FLOAT_H 1
# | #define HAVE_INTTYPES_H 1
# | #define HAVE_LANGINFO_H 1
# | #define HAVE_LIBINTL_H 1
# | #define HAVE_LIMITS_H 1
# | #define HAVE_LOCALE_H 1
# | #define HAVE_MALLOC_H 1
# | #define HAVE_NETDB_H 1
# | #define HAVE_NETINET_IN_H 1
# | #define HAVE_NETINET_TCP_H 1
# | #define HAVE_POLL_H 1
# | #define HAVE_SIGNAL_H 1
# | #define HAVE_STDDEF_H 1
# | #define HAVE_STDINT_H 1
# | #define HAVE_STDIO_EXT_H 1
# | #define HAVE_STDLIB_H 1
# | #define HAVE_STRING_H 1
# | #define HAVE_STRINGS_H 1
# | #define HAVE_SYS_IOCTL_H 1
# | #define HAVE_SYS_PARAM_H 1
# | #define HAVE_SYS_RESOURCE_H 1
# | #define HAVE_SYS_SIGNAL_H 1
# | #define HAVE_SYS_SOCKET_H 1
# | #define HAVE_SYS_TIME_H 1
# | #define HAVE_SYS_TYPES_H 1
# | #define HAVE_SYS_UIO_H 1
# | #define HAVE_SYS_UTSNAME_H 1
# | #define HAVE_TERMIOS_H 1
# | #define HAVE_UNISTD_H 1
# | #define HAVE_UTIME_H 1
# | #define HAVE_WCHAR_H 1
# | #define HAVE_IFADDRS_H 1
# | #define HAVE_PWD_H 1
# | #define TIME_WITH_SYS_TIME 1
# | #define HAVE_PTRDIFF_T 1
# | #define HAVE_A2_STRUCT_TIMESPEC 1
# | #define ENABLE_NLS 1
# | #define HAVE_GETTEXT 1
# | #define HAVE_DCGETTEXT 1
# | #define HAVE_SYS_TIME_H 1
# | #define HAVE_UNISTD_H 1
# | #define HAVE_ALARM 1
# | #define HAVE_SYS_SELECT_H 1
# | #define HAVE_SYS_SOCKET_H 1
# | #define SELECT_TYPE_ARG1 int
# | #define SELECT_TYPE_ARG234 (fd_set *)
# | #define SELECT_TYPE_ARG5 (struct timeval *)
# | #define LSTAT_FOLLOWS_SLASHED_SYMLINK 1
# | #define HAVE_STRFTIME 1
# | #define HAVE_VPRINTF 1
# | #define HAVE_FORK 1
# | #define HAVE_VFORK 1
# | #define HAVE_WORKING_VFORK 1
# | #define HAVE_WORKING_FORK 1
# | #define HAVE___ARGZ_COUNT 1
# | #define HAVE___ARGZ_NEXT 1
# | #define HAVE___ARGZ_STRINGIFY 1
# | #define HAVE_ATEXIT 1
# | #define HAVE_FTRUNCATE 1
# | #define HAVE_GETCWD 1
# | #define HAVE_GETHOSTBYADDR 1
# | #define HAVE_GETHOSTBYNAME 1
# | #define HAVE_GETIFADDRS 1
# | #define HAVE_GETPAGESIZE 1
# | #define HAVE_MEMCHR 1
# | #define HAVE_MEMMOVE 1
# | #define HAVE_MEMPCPY 1
# | #define HAVE_MEMSET 1
# | #define HAVE_MKDIR 1
# | #define HAVE_MMAP 1
# | #define HAVE_MUNMAP 1
# | #define HAVE_NL_LANGINFO 1
# | #define HAVE_POSIX_FADVISE 1
# | #define HAVE_POSIX_MEMALIGN 1
# | #define HAVE_POW 1
# | #define HAVE_PUTENV 1
# | #define HAVE_RMDIR 1
# | #define HAVE_SELECT 1
# | #define HAVE_SETLOCALE 1
# | #define HAVE_SIGACTION 1
# | #define HAVE_SLEEP 1
# | #define HAVE_SOCKET 1
# | #define HAVE_STPCPY 1
# | #define HAVE_STRCASECMP 1
# | #define HAVE_STRCHR 1
# | #define HAVE_STRCSPN 1
# | #define HAVE_STRDUP 1
# | #define HAVE_STRERROR 1
# | #define HAVE_STRNCASECMP 1
# | #define HAVE_STRSTR 1
# | #define HAVE_STRTOL 1
# | #define HAVE_STRTOUL 1
# | #define HAVE_STRTOULL 1
# | #define HAVE_TZSET 1
# | #define HAVE_UNSETENV 1
# | #define HAVE_USLEEP 1
# | #define HAVE_UTIME 1
# | #define HAVE_UTIMES 1
# | #define HAVE_GETRANDOM_INTERFACE 1
# | #define HAVE_EPOLL_CREATE 1
# | #define HAVE_EPOLL 1
# | #define HAVE_POSIX_FALLOCATE 1
# | #define HAVE_FALLOCATE 1
# | #define HAVE_SOME_FALLOCATE 1
# | #define HAVE_ASCTIME_R 1
# | #define HAVE_LOCALTIME_R 1
# | #define HAVE_BASENAME 1
# | #define HAVE_GAI_STRERROR 1
# | #define HAVE_GETADDRINFO 1