Build of aria2 with musl toolchain

The build took 00h 01m 52s and was NOT successful.

The program in this build is written in the following languages, according to sloccount:

SLOCLanguage
112,935 cpp
13,003 makefile
8,560 ansic
4,864 sh
305 python
58 asm
16 sed
139,741 total

The process tree of the build process is here.

Several sub-process invocations were improper; see the process tree for details. Summary:

List of Errors

Log

To avoid scrolling, you may jump to the last line of the invocation of makepkg that was used to build this package.

Removed vanilla repositories from pacman.conf and added:
# [tuscan]
# Server = file:///var/cache/pacman/pkg/

CMD: pacman -Syy --noconfirm
# :: Synchronizing package databases...
# downloading tuscan.db...

There were existing files in /sysroot, using those
# /sysroot/lib
# /sysroot/share
# /sysroot/bin
# /sysroot/include
# /sysroot/libexec

CMD: sudo -u tuscan PATH=/sysroot/bin:/usr/local/sbin:/usr/local/bin:/usr/sbin:/usr/bin:/sbin:/bin CC=clang CXX=clang++ red makepkg --noextract --syncdeps --skipinteg --skippgpcheck --skipchecksums --noconfirm --nocolor --log --noprogressbar --nocheck
# ==> Making package: aria2 1.24.0-1 (Wed Apr 5 01:57:28 UTC 2017)
# ==> Checking runtime dependencies...
# ==> Installing missing dependencies...
# resolving dependencies...
# looking for conflicting packages...
#
# Packages (1) c-ares-1.11.0-1
#
# Total Installed Size: 0.16 MiB
#
# :: Proceed with installation? [Y/n]
# checking keyring...
# checking package integrity...
# loading package files...
# checking for file conflicts...
# checking available disk space...
# :: Processing package changes...
# installing c-ares...
# :: Running post-transaction hooks...
# (1/1) Updating manpage index...
# ==> Checking buildtime dependencies...
# ==> WARNING: Using existing $srcdir/ tree
# ==> Starting build()...
# checking build system type... x86_64-pc-linux-gnu
# checking host system type... x86_64-unknown-linux-gnu
# checking target system type... x86_64-unknown-linux-gnu
# checking for a BSD-compatible install... /usr/bin/install -c
# checking whether build environment is sane... yes
# checking for x86_64-unknown-linux-strip... no
# checking for strip... strip
# checking for a thread-safe mkdir -p... /usr/bin/mkdir -p
# checking for gawk... gawk
# checking whether make sets $(MAKE)... yes
# checking whether make supports nested variables... yes
# checking whether make supports nested variables... (cached) yes
# checking for style of include used by make... GNU
# checking for x86_64-unknown-linux-gcc... clang
# checking whether the C compiler works... yes
# checking for C compiler default output file name... a.out
# checking for suffix of executables...
# checking whether we are cross compiling... no
# checking for suffix of object files... o
# checking whether we are using the GNU C compiler... yes
# checking whether clang accepts -g... yes
# checking for clang option to accept ISO C89... none needed
# checking whether clang understands -c and -o together... yes
# checking dependency style of clang... gcc3
# checking how to run the C preprocessor... clang -E
# checking for grep that handles long lines and -e... /usr/bin/grep
# checking for egrep... /usr/bin/grep -E
# checking for ANSI C header files... yes
# checking for sys/types.h... yes
# checking for sys/stat.h... yes
# checking for stdlib.h... yes
# checking for string.h... yes
# checking for memory.h... yes
# checking for strings.h... yes
# checking for inttypes.h... yes
# checking for stdint.h... yes
# checking for unistd.h... yes
# checking minix/config.h usability... no
# checking minix/config.h presence... no
# checking for minix/config.h... no
# checking whether it is safe to define __EXTENSIONS__... yes
# checking how to print strings... printf
# checking for a sed that does not truncate output... /usr/bin/sed
# checking for fgrep... /usr/bin/grep -F
# checking for ld used by clang... /sysroot/bin/ld
# checking if the linker (/sysroot/bin/ld) is GNU ld... yes
# checking for BSD- or MS-compatible name lister (nm)... no
# checking for x86_64-unknown-linux-dumpbin... no
# checking for x86_64-unknown-linux-link... no
# checking for dumpbin... no
# checking for link... link -dump
# checking the name lister (nm) interface... BSD nm
# checking whether ln -s works... yes
# checking the maximum length of command line arguments... 1572864
# checking how to convert x86_64-pc-linux-gnu file names to x86_64-unknown-linux-gnu format... func_convert_file_noop
# checking how to convert x86_64-pc-linux-gnu file names to toolchain format... func_convert_file_noop
# checking for /sysroot/bin/ld option to reload object files... -r
# checking for x86_64-unknown-linux-objdump... no
# checking for objdump... objdump
# checking how to recognize dependent libraries... pass_all
# checking for x86_64-unknown-linux-dlltool... no
# checking for dlltool... no
# checking how to associate runtime and link libraries... printf %s\n
# checking for x86_64-unknown-linux-ar... no
# checking for ar... ar
# checking for archiver @FILE support... @
# checking for x86_64-unknown-linux-strip... strip
# checking for x86_64-unknown-linux-ranlib... no
# checking for ranlib... ranlib
# checking command to parse nm output from clang object... ok
# checking for sysroot... no
# checking for a working dd... /usr/bin/dd
# checking how to truncate binary pipes... /usr/bin/dd bs=4096 count=1
# checking for x86_64-unknown-linux-mt... no
# checking for mt... no
# checking if : is a manifest tool... no
# checking for dlfcn.h... yes
# checking for objdir... .libs
# checking if clang supports -fno-rtti -fno-exceptions... yes
# checking for clang option to produce PIC... -fPIC -DPIC
# checking if clang PIC flag -fPIC -DPIC works... yes
# checking if clang static flag -static works... no
# checking if clang supports -c -o file.o... yes
# checking if clang supports -c -o file.o... (cached) yes
# checking whether the clang linker (/sysroot/bin/ld -m elf_x86_64) supports shared libraries... yes
# checking whether -lc should be explicitly linked in... no
# checking dynamic linker characteristics... GNU/Linux ld.so
# checking how to hardcode library paths into programs... immediate
# checking whether stripping libraries is possible... yes
# checking if libtool supports shared libraries... yes
# checking whether to build shared libraries... yes
# checking whether to build static libraries... no
# checking for cppunit-config... no
# checking for Cppunit - version >= 1.10.2... no
# checking whether we are using the GNU C++ compiler... yes
# checking whether clang++ accepts -g... yes
# checking dependency style of clang++... gcc3
# checking how to run the C++ preprocessor... clang++ -E
# checking for ld used by clang++... /sysroot/bin/ld -m elf_x86_64
# checking if the linker (/sysroot/bin/ld -m elf_x86_64) is GNU ld... yes
# checking whether the clang++ linker (/sysroot/bin/ld -m elf_x86_64) supports shared libraries... yes
# checking for clang++ option to produce PIC... -fPIC -DPIC
# checking if clang++ PIC flag -fPIC -DPIC works... yes
# checking if clang++ static flag -static works... no
# checking if clang++ supports -c -o file.o... yes
# checking if clang++ supports -c -o file.o... (cached) yes
# checking whether the clang++ linker (/sysroot/bin/ld -m elf_x86_64) supports shared libraries... yes
# checking dynamic linker characteristics... (cached) GNU/Linux ld.so
# checking how to hardcode library paths into programs... immediate
# checking for x86_64-unknown-linux-gcc... (cached) clang
# checking whether we are using the GNU C compiler... (cached) yes
# checking whether clang accepts -g... (cached) yes
# checking for clang option to accept ISO C89... (cached) none needed
# checking whether clang understands -c and -o together... (cached) yes
# checking dependency style of clang... (cached) gcc3
# checking for bison... bison -y
# checking dependency style of clang... gcc3
# checking for x86_64-unknown-linux-ar... ar
# checking for sphinx-build... no
# checking for rst2html.py... no
# checking for rst2html... no
# checking for x86_64-unknown-linux-pkg-config... no
# checking for pkg-config... /usr/bin/pkg-config
# checking pkg-config is at least version 0.20... yes
# checking whether clang++ supports C++11 features by default... no
# checking whether clang++ supports C++11 features with -std=c++11 ... yes
# checking whether the c++ compiler supports nullptr... checking whether the C++ compiler supports `override` keyword... yes
# checking for ZLIB... yes
# checking whether gzbuffer is declared... no
# checking for gzsetparams... no
# checking for xml2-config... /usr/bin/xml2-config
# checking for libxml - version >= 2.6.24... no
# *** Could not run libxml test program, checking why...
# *** The test program failed to compile or link. See the file config.log for the
# *** exact error that occured. This usually means LIBXML was incorrectly installed
# *** or that you have moved LIBXML since it was installed. In the latter case, you
# *** may want to edit the xml2-config script: /usr/bin/xml2-config
# checking for XML_ParserCreate in -lexpat... no
# checking for SQLITE3... yes
# checking for sqlite3_open_v2... no
# checking whether to enable Mac OS X native SSL/TLS... no
# checking for main in -lcrypt32... no
# checking for main in -lsecur32... no
# checking for main in -ladvapi32... no
# checking for wincrypt.h... no
# checking for security.h... no
# checking for LIBGNUTLS... yes
# checking for gnutls_certificate_set_x509_system_trust... no
# checking for nettle_sha1_init in -lnettle... no
# checking for libgcrypt-config... /usr/bin/libgcrypt-config
# checking for LIBGCRYPT - version >= 1.2.4... yes (1.7.1)
# checking for LIBSSH2... yes
# checking for LIBCARES... yes
# checking for ares_addr_node... yes
# checking for ares_set_servers... yes
# checking for size_t... yes
# checking for working alloca.h... yes
# checking for alloca... yes
# checking for ANSI C header files... (cached) yes
# checking argz.h usability... no
# checking argz.h presence... no
# checking for argz.h... no
# checking arpa/inet.h usability... yes
# checking arpa/inet.h presence... yes
# checking for arpa/inet.h... yes
# checking fcntl.h usability... yes
# checking fcntl.h presence... yes
# checking for fcntl.h... yes
# checking float.h usability... yes
# checking float.h presence... yes
# checking for float.h... yes
# checking for inttypes.h... (cached) yes
# checking langinfo.h usability... yes
# checking langinfo.h presence... yes
# checking for langinfo.h... yes
# checking libintl.h usability... yes
# checking libintl.h presence... yes
# checking for libintl.h... yes
# checking limits.h usability... yes
# checking limits.h presence... yes
# checking for limits.h... yes
# checking locale.h usability... yes
# checking locale.h presence... yes
# checking for locale.h... yes
# checking malloc.h usability... yes
# checking malloc.h presence... yes
# checking for malloc.h... yes
# checking netdb.h usability... yes
# checking netdb.h presence... yes
# checking for netdb.h... yes
# checking netinet/in.h usability... yes
# checking netinet/in.h presence... yes
# checking for netinet/in.h... yes
# checking netinet/tcp.h usability... yes
# checking netinet/tcp.h presence... yes
# checking for netinet/tcp.h... yes
# checking poll.h usability... yes
# checking poll.h presence... yes
# checking for poll.h... yes
# checking port.h usability... no
# checking port.h presence... no
# checking for port.h... no
# checking signal.h usability... yes
# checking signal.h presence... yes
# checking for signal.h... yes
# checking stddef.h usability... yes
# checking stddef.h presence... yes
# checking for stddef.h... yes
# checking for stdint.h... (cached) yes
# checking stdio_ext.h usability... yes
# checking stdio_ext.h presence... yes
# checking for stdio_ext.h... yes
# checking for stdlib.h... (cached) yes
# checking for string.h... (cached) yes
# checking for strings.h... (cached) yes
# checking sys/ioctl.h usability... yes
# checking sys/ioctl.h presence... yes
# checking for sys/ioctl.h... yes
# checking sys/param.h usability... yes
# checking sys/param.h presence... yes
# checking for sys/param.h... yes
# checking sys/resource.h usability... yes
# checking sys/resource.h presence... yes
# checking for sys/resource.h... yes
# checking sys/signal.h usability... yes
# checking sys/signal.h presence... yes
# checking for sys/signal.h... yes
# checking sys/socket.h usability... yes
# checking sys/socket.h presence... yes
# checking for sys/socket.h... yes
# checking sys/time.h usability... yes
# checking sys/time.h presence... yes
# checking for sys/time.h... yes
# checking for sys/types.h... (cached) yes
# checking sys/uio.h usability... yes
# checking sys/uio.h presence... yes
# checking for sys/uio.h... yes
# checking sys/utsname.h usability... yes
# checking sys/utsname.h presence... yes
# checking for sys/utsname.h... yes
# checking termios.h usability... yes
# checking termios.h presence... yes
# checking for termios.h... yes
# checking for unistd.h... (cached) yes
# checking utime.h usability... yes
# checking utime.h presence... yes
# checking for utime.h... yes
# checking wchar.h usability... yes
# checking wchar.h presence... yes
# checking for wchar.h... yes
# checking ifaddrs.h usability... yes
# checking ifaddrs.h presence... yes
# checking for ifaddrs.h... yes
# checking pwd.h usability... yes
# checking pwd.h presence... yes
# checking for pwd.h... yes
# checking for stdbool.h that conforms to C99... yes
# checking for _Bool... no
# checking for an ANSI C-conforming const... yes
# checking for inline... inline
# checking for int16_t... yes
# checking for int32_t... yes
# checking for int64_t... yes
# checking for int8_t... yes
# checking for mode_t... yes
# checking for off_t... yes
# checking for size_t... (cached) yes
# checking for ssize_t... yes
# checking whether time.h and sys/time.h may both be included... yes
# checking whether struct tm is in sys/time.h or time.h... time.h
# checking for uint16_t... yes
# checking for uint32_t... yes
# checking for uint64_t... yes
# checking for uint8_t... yes
# checking for pid_t... yes
# checking for working volatile... yes
# checking for ptrdiff_t... yes
# checking for struct timespec... yes
# checking whether byte ordering is bigendian... no
# checking for special C compiler options needed for large files... no
# checking for _FILE_OFFSET_BITS value needed for large files... no
# checking whether NLS is requested... yes
# checking for msgfmt... /usr/bin/msgfmt
# checking for gmsgfmt... /usr/bin/msgfmt
# checking for xgettext... /usr/bin/xgettext
# checking for msgmerge... /usr/bin/msgmerge
# checking for ld used by GCC... /sysroot/bin/ld -m elf_x86_64
# checking if the linker (/sysroot/bin/ld -m elf_x86_64) is GNU ld... yes
# checking for shared library run path origin... done
# checking for CFPreferencesCopyAppValue... no
# checking for CFLocaleCopyCurrent... no
# checking for GNU gettext in libc... no
# checking for iconv... yes
# checking for working iconv... yes
# checking for GNU gettext in libintl... no
# checking whether to use NLS... no
# checking for error_at_line... no
# checking whether clang needs -traditional... no
# checking for working memcmp... yes
# checking for sys/time.h... (cached) yes
# checking for unistd.h... (cached) yes
# checking for alarm... yes
# checking for working mktime... yes
# checking sys/select.h usability... yes
# checking sys/select.h presence... yes
# checking for sys/select.h... yes
# checking for sys/socket.h... (cached) yes
# checking types of arguments for select... int,fd_set *,struct timeval *
# checking whether lstat correctly handles trailing slash... yes
# checking whether stat accepts an empty string... no
# checking for strftime... yes
# checking for vprintf... yes
# checking for _doprnt... no
# checking vfork.h usability... no
# checking vfork.h presence... no
# checking for vfork.h... no
# checking for fork... yes
# checking for vfork... yes
# checking for working fork... yes
# checking for working vfork... (cached) yes
# checking for working strtod... yes
# checking for __argz_count... no
# checking for __argz_next... no
# checking for __argz_stringify... no
# checking for atexit... yes
# checking for ftruncate... yes
# checking for getcwd... yes
# checking for gethostbyaddr... yes
# checking for gethostbyname... yes
# checking for getifaddrs... yes
# checking for getpagesize... yes
# checking for getrandom... no
# checking for memchr... yes
# checking for memmove... yes
# checking for mempcpy... yes
# checking for memset... yes
# checking for mkdir... yes
# checking for mmap... yes
# checking for munmap... yes
# checking for nl_langinfo... yes
# checking for posix_fadvise... yes
# checking for posix_memalign... yes
# checking for pow... yes
# checking for putenv... yes
# checking for rmdir... yes
# checking for select... yes
# checking for setlocale... yes
# checking for sigaction... yes
# checking for sleep... yes
# checking for socket... yes
# checking for stpcpy... yes
# checking for strcasecmp... yes
# checking for strchr... yes
# checking for strcspn... yes
# checking for strdup... yes
# checking for strerror... yes
# checking for strncasecmp... yes
# checking for strstr... yes
# checking for strtol... yes
# checking for strtoul... yes
# checking for strtoull... yes
# checking for tzset... yes
# checking for unsetenv... yes
# checking for usleep... yes
# checking for utime... yes
# checking for utimes... yes
# checking for getrandom linux syscall interface... no
# checking for epoll_create... yes
# checking for posix_fallocate... yes
# checking for fallocate... yes
# checking for asctime_r... yes
# checking for localtime_r... yes
# checking for basename... yes
# checking for gai_strerror... yes
# checking for getaddrinfo... yes
# checking for gettimeofday... yes
# checking for strptime... yes
# checking for timegm... yes
# checking for daemon... yes
# checking for poll... yes
# checking for port_associate... no
# checking for kqueue... no
# checking for struct sockaddr_in.sin_len... no
# checking for struct sockaddr_in6.sin6_len... no
# checking whether struct option.name is assignable from const char*... yes
# checking that generated files are newer than configure... done
# configure: creating ./config.status
# config.status: creating Makefile
# config.status: creating src/Makefile
# config.status: creating src/libaria2.pc
# config.status: creating src/includes/Makefile
# config.status: creating test/Makefile
# config.status: creating po/Makefile.in
# config.status: creating lib/Makefile
# config.status: creating doc/Makefile
# config.status: creating doc/manual-src/Makefile
# config.status: creating doc/manual-src/en/Makefile
# config.status: creating doc/manual-src/en/conf.py
# config.status: creating doc/manual-src/ru/Makefile
# config.status: creating doc/manual-src/ru/conf.py
# config.status: creating doc/manual-src/pt/Makefile
# config.status: creating doc/manual-src/pt/conf.py
# config.status: creating deps/Makefile
# config.status: creating config.h
# config.status: executing depfiles commands
# config.status: executing libtool commands
# config.status: executing po-directories commands
# config.status: creating po/POTFILES
# config.status: creating po/Makefile
# === configuring in deps/wslay (/tmp/aria2/src/aria2-1.24.0/deps/wslay)
# configure: running /bin/sh ./configure --disable-option-checking '--prefix=/usr' '--host=x86_64-unknown-linux' '--with-ca-bundle=/etc/ssl/certs/ca-certificates.crt' 'host_alias=x86_64-unknown-linux' 'CC=clang' 'CFLAGS=' 'LDFLAGS=' 'CPPFLAGS=' 'CXX=clang++' 'CXXFLAGS=' --cache-file=/dev/null --srcdir=.
# checking build system type... x86_64-pc-linux-gnu
# checking host system type... x86_64-unknown-linux-gnu
# checking how to print strings... printf
# checking for x86_64-unknown-linux-gcc... clang
# checking whether the C compiler works... yes
# checking for C compiler default output file name... a.out
# checking for suffix of executables...
# checking whether we are cross compiling... no
# checking for suffix of object files... o
# checking whether we are using the GNU C compiler... yes
# checking whether clang accepts -g... yes
# checking for clang option to accept ISO C89... none needed
# checking whether clang understands -c and -o together... yes
# checking for a sed that does not truncate output... /usr/bin/sed
# checking for grep that handles long lines and -e... /usr/bin/grep
# checking for egrep... /usr/bin/grep -E
# checking for fgrep... /usr/bin/grep -F
# checking for ld used by clang... /sysroot/bin/ld
# checking if the linker (/sysroot/bin/ld) is GNU ld... yes
# checking for BSD- or MS-compatible name lister (nm)... no
# checking for x86_64-unknown-linux-dumpbin... no
# checking for x86_64-unknown-linux-link... no
# checking for dumpbin... no
# checking for link... link -dump
# checking the name lister (nm) interface... BSD nm
# checking whether ln -s works... yes
# checking the maximum length of command line arguments... 1572864
# checking how to convert x86_64-pc-linux-gnu file names to x86_64-unknown-linux-gnu format... func_convert_file_noop
# checking how to convert x86_64-pc-linux-gnu file names to toolchain format... func_convert_file_noop
# checking for /sysroot/bin/ld option to reload object files... -r
# checking for x86_64-unknown-linux-objdump... no
# checking for objdump... objdump
# checking how to recognize dependent libraries... pass_all
# checking for x86_64-unknown-linux-dlltool... no
# checking for dlltool... no
# checking how to associate runtime and link libraries... printf %s\n
# checking for x86_64-unknown-linux-ar... no
# checking for ar... ar
# checking for archiver @FILE support... @
# checking for x86_64-unknown-linux-strip... no
# checking for strip... strip
# checking for x86_64-unknown-linux-ranlib... no
# checking for ranlib... ranlib
# checking for gawk... gawk
# checking command to parse nm output from clang object... ok
# checking for sysroot... no
# checking for a working dd... /usr/bin/dd
# checking how to truncate binary pipes... /usr/bin/dd bs=4096 count=1
# checking for x86_64-unknown-linux-mt... no
# checking for mt... no
# checking if : is a manifest tool... no
# checking how to run the C preprocessor... clang -E
# checking for ANSI C header files... yes
# checking for sys/types.h... yes
# checking for sys/stat.h... yes
# checking for stdlib.h... yes
# checking for string.h... yes
# checking for memory.h... yes
# checking for strings.h... yes
# checking for inttypes.h... yes
# checking for stdint.h... yes
# checking for unistd.h... yes
# checking for dlfcn.h... yes
# checking for objdir... .libs
# checking if clang supports -fno-rtti -fno-exceptions... yes
# checking for clang option to produce PIC... -fPIC -DPIC
# checking if clang PIC flag -fPIC -DPIC works... yes
# checking if clang static flag -static works... no
# checking if clang supports -c -o file.o... yes
# checking if clang supports -c -o file.o... (cached) yes
# checking whether the clang linker (/sysroot/bin/ld -m elf_x86_64) supports shared libraries... yes
# checking whether -lc should be explicitly linked in... no
# checking dynamic linker characteristics... GNU/Linux ld.so
# checking how to hardcode library paths into programs... immediate
# checking whether stripping libraries is possible... yes
# checking if libtool supports shared libraries... yes
# checking whether to build shared libraries... yes
# checking whether to build static libraries... yes
# checking target system type... x86_64-unknown-linux-gnu
# checking for a BSD-compatible install... /usr/bin/install -c
# checking whether build environment is sane... yes
# checking for a thread-safe mkdir -p... /usr/bin/mkdir -p
# checking whether make sets $(MAKE)... yes
# checking for style of include used by make... GNU
# checking whether make supports nested variables... yes
# checking dependency style of clang... gcc3
# checking for x86_64-unknown-linux-gcc... (cached) clang
# checking whether we are using the GNU C compiler... (cached) yes
# checking whether clang accepts -g... (cached) yes
# checking for clang option to accept ISO C89... (cached) none needed
# checking whether clang understands -c and -o together... (cached) yes
# checking whether we are using the GNU C++ compiler... yes
# checking whether clang++ accepts -g... yes
# checking how to run the C++ preprocessor... clang++ -E
# checking for ld used by clang++... /sysroot/bin/ld -m elf_x86_64
# checking if the linker (/sysroot/bin/ld -m elf_x86_64) is GNU ld... yes
# checking whether the clang++ linker (/sysroot/bin/ld -m elf_x86_64) supports shared libraries... yes
# checking for clang++ option to produce PIC... -fPIC -DPIC
# checking if clang++ PIC flag -fPIC -DPIC works... yes
# checking if clang++ static flag -static works... no
# checking if clang++ supports -c -o file.o... yes
# checking if clang++ supports -c -o file.o... (cached) yes
# checking whether the clang++ linker (/sysroot/bin/ld -m elf_x86_64) supports shared libraries... yes
# checking dynamic linker characteristics... (cached) GNU/Linux ld.so
# checking how to hardcode library paths into programs... immediate
# checking dependency style of clang++... gcc3
# checking whether ln -s works... yes
# checking whether make sets $(MAKE)... (cached) yes
# checking for x86_64-unknown-linux-pkg-config... no
# checking for pkg-config... /usr/bin/pkg-config
# checking pkg-config is at least version 0.20... yes
# checking for sphinx-build... no
# checking for NETTLE... yes
# checking for CU_initialize_registry in -lcunit... no
# checking arpa/inet.h usability... yes
# checking arpa/inet.h presence... yes
# checking for arpa/inet.h... yes
# checking netinet/in.h usability... yes
# checking netinet/in.h presence... yes
# checking for netinet/in.h... yes
# checking stddef.h usability... yes
# checking stddef.h presence... yes
# checking for stddef.h... yes
# checking for stdint.h... (cached) yes
# checking for stdlib.h... (cached) yes
# checking for string.h... (cached) yes
# checking for unistd.h... (cached) yes
# checking for size_t... yes
# checking for ssize_t... yes
# checking for uint8_t... yes
# checking for uint16_t... yes
# checking for uint32_t... yes
# checking for uint64_t... yes
# checking for ptrdiff_t... yes
# checking whether byte ordering is bigendian... no
# checking for memmove... yes
# checking for memset... yes
# checking for ntohl... yes
# checking for ntohs... yes
# checking for htons... yes
# checking that generated files are newer than configure... done
# configure: creating ./config.status
# config.status: creating Makefile
# config.status: creating lib/Makefile
# config.status: creating lib/libwslay.pc
# config.status: creating lib/includes/Makefile
# config.status: creating lib/includes/wslay/wslayver.h
# config.status: creating tests/Makefile
# config.status: creating config.h
# config.status: executing libtool commands
# config.status: executing depfiles commands
# configure: summary of build options:
#
# version: 1.0.1-DEV shared 0:1:0
# Host type: x86_64-unknown-linux-gnu
# Install prefix: /usr
# C compiler: clang
# CFlags:
# Library types: Shared=yes, Static=yes
# CUnit: no
# Nettle: yes
# Build examples: yes
#
# configure: summary of build options:
#
# Build: x86_64-pc-linux-gnu
# Host: x86_64-unknown-linux-gnu
# Target: x86_64-unknown-linux-gnu
# Install prefix: /usr
# CC: clang
# CXX: clang++
# CPP: clang -E
# CXXFLAGS:
# CFLAGS:
# CPPFLAGS:
# LDFLAGS:
# LIBS:
# DEFS: -DHAVE_CONFIG_H
# CXX1XCXXFLAGS: -std=c++11
# EXTRACXXFLAGS: -pipe
# EXTRACFLAGS: -pipe
# EXTRACPPFLAGS:
# EXTRALDFLAGS:
# EXTRALIBS:
# WARNCXXFLAGS:
# LibUV: no (CFLAGS='' LIBS='')
# SQLite3: yes (CFLAGS='' LIBS='-lsqlite3')
# SSL Support: yes
# AppleTLS: no (LDFLAGS='')
# WinTLS: no (LIBS='')
# GnuTLS: yes (CFLAGS='-I/usr/include/p11-kit-1' LIBS='-lgnutls')
# OpenSSL: no (CFLAGS='' LIBS='')
# CA Bundle: /etc/ssl/certs/ca-certificates.crt
# LibNettle: no (CFLAGS='' LIBS='')
# LibGmp: no (CFLAGS='' LIBS='')
# LibGcrypt: yes (CFLAGS='' LIBS='-lgcrypt -lgpg-error')
# LibXML2: no (CFLAGS='' LIBS='')
# LibExpat: no (CFLAGS='' LIBS='')
# LibCares: yes (CFLAGS='' LIBS='-lcares')
# Zlib: yes (CFLAGS='' LIBS='-lz')
# Libssh2: yes (CFLAGS='' LIBS='-lssh2')
# Tcmalloc: no (CFLAGS='' LIBS='')
# Jemalloc: no (CFLAGS='' LIBS='')
# Epoll: yes
# Bittorrent: yes
# Metalink: no
# XML-RPC: no
# Message Digest: libgcrypt
# WebSocket: yes (CFLAGS='-I$(top_builddir)/deps/wslay/lib/includes -I$(top_srcdir)/deps/wslay/lib/includes' LIBS='$(top_builddir)/deps/wslay/lib/libwslay.la')
# Libaria2: no (shared=yes static=no)
# bash_completion dir: ${datarootdir}/doc/${PACKAGE_TARNAME}/bash_completion
# Static build: no
#
# make all-recursive
# make[1]: Entering directory '/tmp/aria2/src/aria2-1.24.0'
# Making all in po
# make[2]: Entering directory '/tmp/aria2/src/aria2-1.24.0/po'
# make[2]: Leaving directory '/tmp/aria2/src/aria2-1.24.0/po'
# Making all in lib
# make[2]: Entering directory '/tmp/aria2/src/aria2-1.24.0/lib'
# make[2]: Nothing to be done for 'all'.
# make[2]: Leaving directory '/tmp/aria2/src/aria2-1.24.0/lib'
# Making all in deps
# make[2]: Entering directory '/tmp/aria2/src/aria2-1.24.0/deps'
# Making all in wslay
# make[3]: Entering directory '/tmp/aria2/src/aria2-1.24.0/deps/wslay'
# make all-recursive
# make[4]: Entering directory '/tmp/aria2/src/aria2-1.24.0/deps/wslay'
# Making all in lib
# make[5]: Entering directory '/tmp/aria2/src/aria2-1.24.0/deps/wslay/lib'
# Making all in includes
# make[6]: Entering directory '/tmp/aria2/src/aria2-1.24.0/deps/wslay/lib/includes'
# make[6]: Nothing to be done for 'all'.
# make[6]: Leaving directory '/tmp/aria2/src/aria2-1.24.0/deps/wslay/lib/includes'
# make[6]: Entering directory '/tmp/aria2/src/aria2-1.24.0/deps/wslay/lib'
# /bin/sh ../libtool --tag=CC --mode=compile clang -DHAVE_CONFIG_H -I. -I.. -DHAVE_CONFIG_H -I./includes -I./includes -Wall -MT wslay_frame.lo -MD -MP -MF .deps/wslay_frame.Tpo -c -o wslay_frame.lo wslay_frame.c
# /bin/sh ../libtool --tag=CC --mode=compile clang -DHAVE_CONFIG_H -I. -I.. -DHAVE_CONFIG_H -I./includes -I./includes -Wall -MT wslay_event.lo -MD -MP -MF .deps/wslay_event.Tpo -c -o wslay_event.lo wslay_event.c
# /bin/sh ../libtool --tag=CC --mode=compile clang -DHAVE_CONFIG_H -I. -I.. -DHAVE_CONFIG_H -I./includes -I./includes -Wall -MT wslay_queue.lo -MD -MP -MF .deps/wslay_queue.Tpo -c -o wslay_queue.lo wslay_queue.c
# /bin/sh ../libtool --tag=CC --mode=compile clang -DHAVE_CONFIG_H -I. -I.. -DHAVE_CONFIG_H -I./includes -I./includes -Wall -MT wslay_net.lo -MD -MP -MF .deps/wslay_net.Tpo -c -o wslay_net.lo wslay_net.c
# libtool: compile: clang -DHAVE_CONFIG_H -I. -I.. -DHAVE_CONFIG_H -I./includes -I./includes -Wall -MT wslay_frame.lo -MD -MP -MF .deps/wslay_frame.Tpo -c wslay_frame.c -fPIC -DPIC -o .libs/wslay_frame.o
# libtool: compile: clang -DHAVE_CONFIG_H -I. -I.. -DHAVE_CONFIG_H -I./includes -I./includes -Wall -MT wslay_net.lo -MD -MP -MF .deps/wslay_net.Tpo -c wslay_net.c -fPIC -DPIC -o .libs/wslay_net.o
# libtool: compile: clang -DHAVE_CONFIG_H -I. -I.. -DHAVE_CONFIG_H -I./includes -I./includes -Wall -MT wslay_net.lo -MD -MP -MF .deps/wslay_net.Tpo -c wslay_net.c -o wslay_net.o >/dev/null 2>&1
# libtool: compile: clang -DHAVE_CONFIG_H -I. -I.. -DHAVE_CONFIG_H -I./includes -I./includes -Wall -MT wslay_event.lo -MD -MP -MF .deps/wslay_event.Tpo -c wslay_event.c -fPIC -DPIC -o .libs/wslay_event.o
# libtool: compile: clang -DHAVE_CONFIG_H -I. -I.. -DHAVE_CONFIG_H -I./includes -I./includes -Wall -MT wslay_queue.lo -MD -MP -MF .deps/wslay_queue.Tpo -c wslay_queue.c -fPIC -DPIC -o .libs/wslay_queue.o
# libtool: compile: clang -DHAVE_CONFIG_H -I. -I.. -DHAVE_CONFIG_H -I./includes -I./includes -Wall -MT wslay_queue.lo -MD -MP -MF .deps/wslay_queue.Tpo -c wslay_queue.c -o wslay_queue.o >/dev/null 2>&1
# libtool: compile: clang -DHAVE_CONFIG_H -I. -I.. -DHAVE_CONFIG_H -I./includes -I./includes -Wall -MT wslay_frame.lo -MD -MP -MF .deps/wslay_frame.Tpo -c wslay_frame.c -o wslay_frame.o >/dev/null 2>&1
# mv -f .deps/wslay_net.Tpo .deps/wslay_net.Plo
# mv -f .deps/wslay_queue.Tpo .deps/wslay_queue.Plo
# mv -f .deps/wslay_frame.Tpo .deps/wslay_frame.Plo
# libtool: compile: clang -DHAVE_CONFIG_H -I. -I.. -DHAVE_CONFIG_H -I./includes -I./includes -Wall -MT wslay_event.lo -MD -MP -MF .deps/wslay_event.Tpo -c wslay_event.c -o wslay_event.o >/dev/null 2>&1
# mv -f .deps/wslay_event.Tpo .deps/wslay_event.Plo
# /bin/sh ../libtool --tag=CC --mode=link clang -Wall -no-undefined -version-info 0:1:0 -o libwslay.la wslay_frame.lo wslay_event.lo wslay_queue.lo wslay_net.lo
# libtool: warning: '-version-info/-version-number' is ignored for convenience libraries
# libtool: link: ar cru .libs/libwslay.a .libs/wslay_frame.o .libs/wslay_event.o .libs/wslay_queue.o .libs/wslay_net.o
# /r: `u' modifier ignored since `D' is the default (see `U')
# libtool: link: ranlib .libs/libwslay.a
# libtool: link: ( cd ".libs" && rm -f "libwslay.la" && ln -s "../libwslay.la" "libwslay.la" )
# make[6]: Leaving directory '/tmp/aria2/src/aria2-1.24.0/deps/wslay/lib'
# make[5]: Leaving directory '/tmp/aria2/src/aria2-1.24.0/deps/wslay/lib'
# Making all in tests
# make[5]: Entering directory '/tmp/aria2/src/aria2-1.24.0/deps/wslay/tests'
# make[5]: Nothing to be done for 'all'.
# make[5]: Leaving directory '/tmp/aria2/src/aria2-1.24.0/deps/wslay/tests'
# make[5]: Entering directory '/tmp/aria2/src/aria2-1.24.0/deps/wslay'
# make[5]: Leaving directory '/tmp/aria2/src/aria2-1.24.0/deps/wslay'
# make[4]: Leaving directory '/tmp/aria2/src/aria2-1.24.0/deps/wslay'
# make[3]: Leaving directory '/tmp/aria2/src/aria2-1.24.0/deps/wslay'
# make[3]: Entering directory '/tmp/aria2/src/aria2-1.24.0/deps'
# make[3]: Nothing to be done for 'all-am'.
# make[3]: Leaving directory '/tmp/aria2/src/aria2-1.24.0/deps'
# make[2]: Leaving directory '/tmp/aria2/src/aria2-1.24.0/deps'
# Making all in src
# make[2]: Entering directory '/tmp/aria2/src/aria2-1.24.0/src'
# Making all in includes
# make[3]: Entering directory '/tmp/aria2/src/aria2-1.24.0/src/includes'
# make[3]: Nothing to be done for 'all'.
# make[3]: Leaving directory '/tmp/aria2/src/aria2-1.24.0/src/includes'
# make[3]: Entering directory '/tmp/aria2/src/aria2-1.24.0/src'
# CXX A2STR.lo
# CXX AbstractAuthResolver.lo
# CXX AbstractCommand.lo
# CXX AbstractDiskWriter.lo
# CXX AbstractHttpServerResponseCommand.lo
# CXX AbstractOptionHandler.lo
# CXX AbstractProxyRequestCommand.lo
# CXX AbstractProxyResponseCommand.lo
# CXX AbstractSingleDiskAdaptor.lo
# CXX AdaptiveFileAllocationIterator.lo
# CXX AdaptiveURISelector.lo
# CXX AuthConfig.lo
# CXX AuthConfigFactory.lo
# CXX AutoSaveCommand.lo
# CXX BackupIPv4ConnectCommand.lo
# CXX base32.lo
# CXX bitfield.lo
# CXX BitfieldMan.lo
# CXX BufferedFile.lo
# CXX ByteArrayDiskWriter.lo
# CXX CheckIntegrityCommand.lo
# CXX CheckIntegrityDispatcherCommand.lo
# CXX CheckIntegrityEntry.lo
# CXX Checksum.lo
# CXX ChecksumCheckIntegrityEntry.lo
# CXX ChunkChecksum.lo
# CXX ChunkedDecodingStreamFilter.lo
# CXX ColorizedStream.lo
# CXX Command.lo
# CXX ConnectCommand.lo
# CXX console.lo
# CXX ConsoleStatCalc.lo
# CXX ContentTypeRequestGroupCriteria.lo
# CXX Context.lo
# CXX ContextAttribute.lo
# CXX Cookie.lo
# CXX CookieStorage.lo
# CXX cookie_helper.lo
# CXX CreateRequestCommand.lo
# CXX CUIDCounter.lo
# In file included from CookieStorage.cc:54:
# In file included from ./Sqlite3CookieParserImpl.h:38:
# ./Sqlite3CookieParser.h:44:10: fatal error: 'sqlite3.h' file not found
# #include
# ^
# 1 error generated.
# make[3]: *** [Makefile:2368: CookieStorage.lo] Error 1
# make[3]: *** Waiting for unfinished jobs....
# make[3]: Leaving directory '/tmp/aria2/src/aria2-1.24.0/src'
# make[2]: *** [Makefile:2410: all-recursive] Error 1
# make[2]: Leaving directory '/tmp/aria2/src/aria2-1.24.0/src'
# make[1]: *** [Makefile:560: all-recursive] Error 1
# make[1]: Leaving directory '/tmp/aria2/src/aria2-1.24.0'
# make: *** [Makefile:471: all] Error 2
# ==> ERROR: A failure occurred in build().
# Aborting...

Printing config logfiles

CMD: config logfiles '/tmp/aria2/src/aria2-1.24.0/config.log'
# This file contains any messages produced by compilers while
# running configure, to aid debugging if configure makes a mistake.
#
# It was created by aria2 configure 1.24.0, which was
# generated by GNU Autoconf 2.69. Invocation command line was
#
# $ ./configure --host=x86_64-unknown-linux --prefix=/usr --with-ca-bundle=/etc/ssl/certs/ca-certificates.crt
#
# ## --------- ##
# ## Platform. ##
# ## --------- ##
#
# hostname = edf004c1bac5
# uname -m = x86_64
# uname -r = 4.10.6-1-ARCH
# uname -s = Linux
# uname -v = #1 SMP PREEMPT Mon Mar 27 08:28:22 CEST 2017
#
# /usr/bin/uname -p = unknown
# /bin/uname -X = unknown
#
# /bin/arch = unknown
# /usr/bin/arch -k = unknown
# /usr/convex/getsysinfo = unknown
# /usr/bin/hostinfo = unknown
# /bin/machine = unknown
# /usr/bin/oslevel = unknown
# /bin/universe = unknown
#
# PATH: /sysroot/bin
# PATH: /usr/local/sbin
# PATH: /usr/local/bin
# PATH: /usr/bin
# PATH: /usr/lib/jvm/default/bin
# PATH: /usr/bin/site_perl
# PATH: /usr/bin/vendor_perl
# PATH: /usr/bin/core_perl
#
#
# ## ----------- ##
# ## Core tests. ##
# ## ----------- ##
#
# configure:3263: checking build system type
# configure:3277: result: x86_64-pc-linux-gnu
# configure:3297: checking host system type
# configure:3310: result: x86_64-unknown-linux-gnu
# configure:3330: checking target system type
# configure:3343: result: x86_64-unknown-linux-gnu
# configure:3386: checking for a BSD-compatible install
# configure:3454: result: /usr/bin/install -c
# configure:3465: checking whether build environment is sane
# configure:3520: result: yes
# configure:3579: checking for x86_64-unknown-linux-strip
# configure:3609: result: no
# configure:3619: checking for strip
# configure:3635: found /sysroot/bin/strip
# configure:3646: result: strip
# configure:3671: checking for a thread-safe mkdir -p
# configure:3710: result: /usr/bin/mkdir -p
# configure:3717: checking for gawk
# configure:3733: found /usr/bin/gawk
# configure:3744: result: gawk
# configure:3755: checking whether make sets $(MAKE)
# configure:3777: result: yes
# configure:3806: checking whether make supports nested variables
# configure:3823: result: yes
# configure:3960: checking whether make supports nested variables
# configure:3977: result: yes
# configure:4001: checking for style of include used by make
# configure:4029: result: GNU
# configure:4060: checking for x86_64-unknown-linux-gcc
# configure:4087: result: clang
# configure:4356: checking for C compiler version
# configure:4365: clang --version >&5
# clang version 3.8.1
# Target: x86_64-unknown-linux-gnu
# Thread model: posix
# InstalledDir: /
# configure:4376: $? = 0
# configure:4365: clang -v >&5
# clang version 3.8.1
# Target: x86_64-unknown-linux-gnu
# Thread model: posix
# InstalledDir: /
# Found candidate GCC installation: //../lib/gcc/x86_64-pc-linux-gnu/6.1.1
# Found candidate GCC installation: //../lib64/gcc/x86_64-pc-linux-gnu/6.1.1
# Selected GCC installation: //../lib64/gcc/x86_64-pc-linux-gnu/6.1.1
# Candidate multilib: .;@m64
# Selected multilib: .;@m64
# configure:4376: $? = 0
# configure:4365: clang -V >&5
# clang-3.8: error: argument to '-V' is missing (expected 1 value)
# clang-3.8: error: no input files
# configure:4376: $? = 1
# configure:4365: clang -qversion >&5
# clang-3.8: error: unknown argument: '-qversion'
# clang-3.8: error: no input files
# configure:4376: $? = 1
# configure:4396: checking whether the C compiler works
# configure:4418: clang conftest.c >&5
# configure:4422: $? = 0
# configure:4470: result: yes
# configure:4473: checking for C compiler default output file name
# configure:4475: result: a.out
# configure:4481: checking for suffix of executables
# configure:4488: clang -o conftest conftest.c >&5
# configure:4492: $? = 0
# configure:4514: result:
# configure:4536: checking whether we are cross compiling
# configure:4544: clang -o conftest conftest.c >&5
# configure:4548: $? = 0
# configure:4555: ./conftest
# configure:4559: $? = 0
# configure:4574: result: no
# configure:4579: checking for suffix of object files
# configure:4601: clang -c conftest.c >&5
# configure:4605: $? = 0
# configure:4626: result: o
# configure:4630: checking whether we are using the GNU C compiler
# configure:4649: clang -c conftest.c >&5
# configure:4649: $? = 0
# configure:4658: result: yes
# configure:4667: checking whether clang accepts -g
# configure:4687: clang -c -g conftest.c >&5
# configure:4687: $? = 0
# configure:4728: result: yes
# configure:4745: checking for clang option to accept ISO C89
# configure:4808: clang -c conftest.c >&5
# configure:4808: $? = 0
# configure:4821: result: none needed
# configure:4846: checking whether clang understands -c and -o together
# configure:4868: clang -c conftest.c -o conftest2.o
# configure:4871: $? = 0
# configure:4868: clang -c conftest.c -o conftest2.o
# configure:4871: $? = 0
# configure:4883: result: yes
# configure:4902: checking dependency style of clang
# configure:5013: result: gcc3
# configure:5034: checking how to run the C preprocessor
# configure:5065: clang -E conftest.c
# configure:5065: $? = 0
# configure:5079: clang -E conftest.c
# conftest.c:11:10: fatal error: 'ac_nonexistent.h' file not found
# #include
# ^
# 1 error generated.
# configure:5079: $? = 1
# configure: failed program was:
# | /* confdefs.h */
# | #define PACKAGE_NAME "aria2"
# | #define PACKAGE_TARNAME "aria2"
# | #define PACKAGE_VERSION "1.24.0"
# | #define PACKAGE_STRING "aria2 1.24.0"
# | #define PACKAGE_BUGREPORT "https://github.com/aria2/aria2/issues"
# | #define PACKAGE_URL "https://aria2.github.io/"
# | #define PACKAGE "aria2"
# | #define VERSION "1.24.0"
# | /* end confdefs.h. */
# | #include
# configure:5104: result: clang -E
# configure:5124: clang -E conftest.c
# configure:5124: $? = 0
# configure:5138: clang -E conftest.c
# conftest.c:11:10: fatal error: 'ac_nonexistent.h' file not found
# #include
# ^
# 1 error generated.
# configure:5138: $? = 1
# configure: failed program was:
# | /* confdefs.h */
# | #define PACKAGE_NAME "aria2"
# | #define PACKAGE_TARNAME "aria2"
# | #define PACKAGE_VERSION "1.24.0"
# | #define PACKAGE_STRING "aria2 1.24.0"
# | #define PACKAGE_BUGREPORT "https://github.com/aria2/aria2/issues"
# | #define PACKAGE_URL "https://aria2.github.io/"
# | #define PACKAGE "aria2"
# | #define VERSION "1.24.0"
# | /* end confdefs.h. */
# | #include
# configure:5167: checking for grep that handles long lines and -e
# configure:5225: result: /usr/bin/grep
# configure:5230: checking for egrep
# configure:5292: result: /usr/bin/grep -E
# configure:5297: checking for ANSI C header files
# configure:5317: clang -c conftest.c >&5
# configure:5317: $? = 0
# configure:5390: clang -o conftest conftest.c >&5
# configure:5390: $? = 0
# configure:5390: ./conftest
# configure:5390: $? = 0
# configure:5401: result: yes
# configure:5414: checking for sys/types.h
# configure:5414: clang -c conftest.c >&5
# configure:5414: $? = 0
# configure:5414: result: yes
# configure:5414: checking for sys/stat.h
# configure:5414: clang -c conftest.c >&5
# configure:5414: $? = 0
# configure:5414: result: yes
# configure:5414: checking for stdlib.h
# configure:5414: clang -c conftest.c >&5
# configure:5414: $? = 0
# configure:5414: result: yes
# configure:5414: checking for string.h
# configure:5414: clang -c conftest.c >&5
# configure:5414: $? = 0
# configure:5414: result: yes
# configure:5414: checking for memory.h
# configure:5414: clang -c conftest.c >&5
# configure:5414: $? = 0
# configure:5414: result: yes
# configure:5414: checking for strings.h
# configure:5414: clang -c conftest.c >&5
# configure:5414: $? = 0
# configure:5414: result: yes
# configure:5414: checking for inttypes.h
# configure:5414: clang -c conftest.c >&5
# configure:5414: $? = 0
# configure:5414: result: yes
# configure:5414: checking for stdint.h
# configure:5414: clang -c conftest.c >&5
# configure:5414: $? = 0
# configure:5414: result: yes
# configure:5414: checking for unistd.h
# configure:5414: clang -c conftest.c >&5
# configure:5414: $? = 0
# configure:5414: result: yes
# configure:5427: checking minix/config.h usability
# configure:5427: clang -c conftest.c >&5
# conftest.c:54:10: fatal error: 'minix/config.h' file not found
# #include
# ^
# 1 error generated.
# configure:5427: $? = 1
# configure: failed program was:
# | /* confdefs.h */
# | #define PACKAGE_NAME "aria2"
# | #define PACKAGE_TARNAME "aria2"
# | #define PACKAGE_VERSION "1.24.0"
# | #define PACKAGE_STRING "aria2 1.24.0"
# | #define PACKAGE_BUGREPORT "https://github.com/aria2/aria2/issues"
# | #define PACKAGE_URL "https://aria2.github.io/"
# | #define PACKAGE "aria2"
# | #define VERSION "1.24.0"
# | #define STDC_HEADERS 1
# | #define HAVE_SYS_TYPES_H 1
# | #define HAVE_SYS_STAT_H 1
# | #define HAVE_STDLIB_H 1
# | #define HAVE_STRING_H 1
# | #define HAVE_MEMORY_H 1
# | #define HAVE_STRINGS_H 1
# | #define HAVE_INTTYPES_H 1
# | #define HAVE_STDINT_H 1
# | #define HAVE_UNISTD_H 1
# | /* end confdefs.h. */
# | #include
# | #ifdef HAVE_SYS_TYPES_H
# | # include
# | #endif
# | #ifdef HAVE_SYS_STAT_H
# | # include
# | #endif
# | #ifdef STDC_HEADERS
# | # include
# | # include
# | #else
# | # ifdef HAVE_STDLIB_H
# | # include
# | # endif
# | #endif
# | #ifdef HAVE_STRING_H
# | # if !defined STDC_HEADERS && defined HAVE_MEMORY_H
# | # include
# | # endif
# | # include
# | #endif
# | #ifdef HAVE_STRINGS_H
# | # include
# | #endif
# | #ifdef HAVE_INTTYPES_H
# | # include
# | #endif
# | #ifdef HAVE_STDINT_H
# | # include
# | #endif
# | #ifdef HAVE_UNISTD_H
# | # include
# | #endif
# | #include
# configure:5427: result: no
# configure:5427: checking minix/config.h presence
# configure:5427: clang -E conftest.c
# conftest.c:21:10: fatal error: 'minix/config.h' file not found
# #include
# ^
# 1 error generated.
# configure:5427: $? = 1
# configure: failed program was:
# | /* confdefs.h */
# | #define PACKAGE_NAME "aria2"
# | #define PACKAGE_TARNAME "aria2"
# | #define PACKAGE_VERSION "1.24.0"
# | #define PACKAGE_STRING "aria2 1.24.0"
# | #define PACKAGE_BUGREPORT "https://github.com/aria2/aria2/issues"
# | #define PACKAGE_URL "https://aria2.github.io/"
# | #define PACKAGE "aria2"
# | #define VERSION "1.24.0"
# | #define STDC_HEADERS 1
# | #define HAVE_SYS_TYPES_H 1
# | #define HAVE_SYS_STAT_H 1
# | #define HAVE_STDLIB_H 1
# | #define HAVE_STRING_H 1
# | #define HAVE_MEMORY_H 1
# | #define HAVE_STRINGS_H 1
# | #define HAVE_INTTYPES_H 1
# | #define HAVE_STDINT_H 1
# | #define HAVE_UNISTD_H 1
# | /* end confdefs.h. */
# | #include
# configure:5427: result: no
# configure:5427: checking for minix/config.h
# configure:5427: result: no
# configure:5448: checking whether it is safe to define __EXTENSIONS__
# configure:5466: clang -c conftest.c >&5
# configure:5466: $? = 0
# configure:5473: result: yes
# configure:5535: checking how to print strings
# configure:5562: result: printf
# configure:5583: checking for a sed that does not truncate output
# configure:5647: result: /usr/bin/sed
# configure:5665: checking for fgrep
# configure:5727: result: /usr/bin/grep -F
# configure:5762: checking for ld used by clang
# configure:5829: result: /sysroot/bin/ld
# configure:5836: checking if the linker (/sysroot/bin/ld) is GNU ld
# configure:5851: result: yes
# configure:5863: checking for BSD- or MS-compatible name lister (nm)
# configure:5917: result: no
# configure:5931: checking for x86_64-unknown-linux-dumpbin
# configure:5961: result: no
# configure:5931: checking for x86_64-unknown-linux-link
# configure:5961: result: no
# configure:5975: checking for dumpbin
# configure:6005: result: no
# configure:5975: checking for link
# configure:5991: found /usr/bin/link
# configure:6002: result: link -dump
# configure:6047: checking the name lister (nm) interface
# configure:6054: clang -c conftest.c >&5
# configure:6057: nm "conftest.o"
# configure:6060: output
# 0000000000000000 B some_variable
# configure:6067: result: BSD nm
# configure:6070: checking whether ln -s works
# configure:6074: result: yes
# configure:6082: checking the maximum length of command line arguments
# configure:6213: result: 1572864
# configure:6261: checking how to convert x86_64-pc-linux-gnu file names to x86_64-unknown-linux-gnu format
# configure:6301: result: func_convert_file_noop
# configure:6308: checking how to convert x86_64-pc-linux-gnu file names to toolchain format
# configure:6328: result: func_convert_file_noop
# configure:6335: checking for /sysroot/bin/ld option to reload object files
# configure:6342: result: -r
# configure:6376: checking for x86_64-unknown-linux-objdump
# configure:6406: result: no
# configure:6416: checking for objdump
# configure:6432: found /sysroot/bin/objdump
# configure:6443: result: objdump
# configure:6475: checking how to recognize dependent libraries
# configure:6675: result: pass_all
# configure:6720: checking for x86_64-unknown-linux-dlltool
# configure:6750: result: no
# configure:6760: checking for dlltool
# configure:6790: result: no
# configure:6820: checking how to associate runtime and link libraries
# configure:6847: result: printf %s\n
# configure:6863: checking for x86_64-unknown-linux-ar
# configure:6893: result: no
# configure:6907: checking for ar
# configure:6923: found /sysroot/bin/ar
# configure:6934: result: ar
# configure:6971: checking for archiver @FILE support
# configure:6988: clang -c conftest.c >&5
# configure:6988: $? = 0
# configure:6991: ar cru libconftest.a @conftest.lst >&5
# /r: `u' modifier ignored since `D' is the default (see `U')
# configure:6994: $? = 0
# configure:6999: ar cru libconftest.a @conftest.lst >&5
# /r: `u' modifier ignored since `D' is the default (see `U')
# /r: conftest.o: No such file or directory
# configure:7002: $? = 1
# configure:7014: result: @
# configure:7032: checking for x86_64-unknown-linux-strip
# configure:7059: result: strip
# configure:7131: checking for x86_64-unknown-linux-ranlib
# configure:7161: result: no
# configure:7171: checking for ranlib
# configure:7187: found /sysroot/bin/ranlib
# configure:7198: result: ranlib
# configure:7300: checking command to parse nm output from clang object
# configure:7453: clang -c conftest.c >&5
# configure:7456: $? = 0
# configure:7460: nm conftest.o \| sed -n -e 's/^.*[ ]\([ABCDGIRSTW][ABCDGIRSTW]*\)[ ][ ]*\([_A-Za-z][_A-Za-z0-9]*\)$/\1 \2 \2/p' | sed '/ __gnu_lto/d' \> conftest.nm
# configure:7463: $? = 0
# configure:7529: clang -o conftest conftest.c conftstm.o >&5
# configure:7532: $? = 0
# configure:7570: result: ok
# configure:7617: checking for sysroot
# configure:7647: result: no
# configure:7654: checking for a working dd
# configure:7692: result: /usr/bin/dd
# configure:7696: checking how to truncate binary pipes
# configure:7711: result: /usr/bin/dd bs=4096 count=1
# configure:7847: clang -c conftest.c >&5
# configure:7850: $? = 0
# configure:8000: checking for x86_64-unknown-linux-mt
# configure:8030: result: no
# configure:8040: checking for mt
# configure:8070: result: no
# configure:8090: checking if : is a manifest tool
# configure:8096: : '-?'
# configure:8104: result: no
# configure:8778: checking for dlfcn.h
# configure:8778: clang -c conftest.c >&5
# configure:8778: $? = 0
# configure:8778: result: yes
# configure:9033: checking for objdir
# configure:9048: result: .libs
# configure:9312: checking if clang supports -fno-rtti -fno-exceptions
# configure:9330: clang -c -fno-rtti -fno-exceptions conftest.c >&5
# configure:9334: $? = 0
# configure:9347: result: yes
# configure:9705: checking for clang option to produce PIC
# configure:9712: result: -fPIC -DPIC
# configure:9720: checking if clang PIC flag -fPIC -DPIC works
# configure:9738: clang -c -fPIC -DPIC -DPIC conftest.c >&5
# configure:9742: $? = 0
# configure:9755: result: yes
# configure:9784: checking if clang static flag -static works
# configure:9812: result: no
# configure:9827: checking if clang supports -c -o file.o
# configure:9848: clang -c -o out/conftest2.o conftest.c >&5
# configure:9852: $? = 0
# configure:9874: result: yes
# configure:9882: checking if clang supports -c -o file.o
# configure:9929: result: yes
# configure:9962: checking whether the clang linker (/sysroot/bin/ld -m elf_x86_64) supports shared libraries
# configure:11225: result: yes
# configure:11262: checking whether -lc should be explicitly linked in
# configure:11270: clang -c conftest.c >&5
# configure:11273: $? = 0
# configure:11288: clang -shared -fPIC -DPIC conftest.o -v -Wl,-soname -Wl,conftest -o conftest 2\>\&1 \| /usr/bin/grep -lc \>/dev/null 2\>\&1
# configure:11291: $? = 0
# configure:11305: result: no
# configure:11465: checking dynamic linker characteristics
# configure:12046: clang -o conftest -Wl,-rpath -Wl,/foo conftest.c >&5
# configure:12046: $? = 0
# configure:12295: result: GNU/Linux ld.so
# configure:12417: checking how to hardcode library paths into programs
# configure:12442: result: immediate
# configure:12990: checking whether stripping libraries is possible
# configure:12995: result: yes
# configure:13030: checking if libtool supports shared libraries
# configure:13032: result: yes
# configure:13035: checking whether to build shared libraries
# configure:13060: result: yes
# configure:13063: checking whether to build static libraries
# configure:13067: result: no
# configure:13146: checking for cppunit-config
# configure:13177: result: no
# configure:13187: checking for Cppunit - version >= 1.10.2
# configure:13191: result: no
# configure:13660: checking for C++ compiler version
# configure:13669: clang++ --version >&5
# clang version 3.8.1
# Target: x86_64-unknown-linux-gnu
# Thread model: posix
# InstalledDir: /
# configure:13680: $? = 0
# configure:13669: clang++ -v >&5
# clang version 3.8.1
# Target: x86_64-unknown-linux-gnu
# Thread model: posix
# InstalledDir: /
# Found candidate GCC installation: //../lib/gcc/x86_64-pc-linux-gnu/6.1.1
# Found candidate GCC installation: //../lib64/gcc/x86_64-pc-linux-gnu/6.1.1
# Selected GCC installation: //../lib64/gcc/x86_64-pc-linux-gnu/6.1.1
# Candidate multilib: .;@m64
# Selected multilib: .;@m64
# configure:13680: $? = 0
# configure:13669: clang++ -V >&5
# clang-3.8: error: argument to '-V' is missing (expected 1 value)
# clang-3.8: error: no input files
# configure:13680: $? = 1
# configure:13669: clang++ -qversion >&5
# clang-3.8: error: unknown argument: '-qversion'
# clang-3.8: error: no input files
# configure:13680: $? = 1
# configure:13684: checking whether we are using the GNU C++ compiler
# configure:13703: clang++ -c conftest.cpp >&5
# configure:13703: $? = 0
# configure:13712: result: yes
# configure:13721: checking whether clang++ accepts -g
# configure:13741: clang++ -c -g conftest.cpp >&5
# configure:13741: $? = 0
# configure:13782: result: yes
# configure:13807: checking dependency style of clang++
# configure:13918: result: gcc3
# configure:13951: checking how to run the C++ preprocessor
# configure:13978: clang++ -E conftest.cpp
# configure:13978: $? = 0
# configure:13992: clang++ -E conftest.cpp
# conftest.cpp:32:10: fatal error: 'ac_nonexistent.h' file not found
# #include
# ^
# 1 error generated.
# configure:13992: $? = 1
# configure: failed program was:
# | /* confdefs.h */
# | #define PACKAGE_NAME "aria2"
# | #define PACKAGE_TARNAME "aria2"
# | #define PACKAGE_VERSION "1.24.0"
# | #define PACKAGE_STRING "aria2 1.24.0"
# | #define PACKAGE_BUGREPORT "https://github.com/aria2/aria2/issues"
# | #define PACKAGE_URL "https://aria2.github.io/"
# | #define PACKAGE "aria2"
# | #define VERSION "1.24.0"
# | #define STDC_HEADERS 1
# | #define HAVE_SYS_TYPES_H 1
# | #define HAVE_SYS_STAT_H 1
# | #define HAVE_STDLIB_H 1
# | #define HAVE_STRING_H 1
# | #define HAVE_MEMORY_H 1
# | #define HAVE_STRINGS_H 1
# | #define HAVE_INTTYPES_H 1
# | #define HAVE_STDINT_H 1
# | #define HAVE_UNISTD_H 1
# | #define __EXTENSIONS__ 1
# | #define _ALL_SOURCE 1
# | #define _GNU_SOURCE 1
# | #define _POSIX_PTHREAD_SEMANTICS 1
# | #define _TANDEM_SOURCE 1
# | #define HAVE_DLFCN_H 1
# | #define LT_OBJDIR ".libs/"
# | #define BUILD "x86_64-pc-linux-gnu"
# | #define HOST "x86_64-unknown-linux-gnu"
# | #define TARGET "x86_64-unknown-linux-gnu"
# | #define CA_BUNDLE "/etc/ssl/certs/ca-certificates.crt"
# | /* end confdefs.h. */
# | #include
# configure:14017: result: clang++ -E
# configure:14037: clang++ -E conftest.cpp
# configure:14037: $? = 0
# configure:14051: clang++ -E conftest.cpp
# conftest.cpp:32:10: fatal error: 'ac_nonexistent.h' file not found
# #include
# ^
# 1 error generated.
# configure:14051: $? = 1
# configure: failed program was:
# | /* confdefs.h */
# | #define PACKAGE_NAME "aria2"
# | #define PACKAGE_TARNAME "aria2"
# | #define PACKAGE_VERSION "1.24.0"
# | #define PACKAGE_STRING "aria2 1.24.0"
# | #define PACKAGE_BUGREPORT "https://github.com/aria2/aria2/issues"
# | #define PACKAGE_URL "https://aria2.github.io/"
# | #define PACKAGE "aria2"
# | #define VERSION "1.24.0"
# | #define STDC_HEADERS 1
# | #define HAVE_SYS_TYPES_H 1
# | #define HAVE_SYS_STAT_H 1
# | #define HAVE_STDLIB_H 1
# | #define HAVE_STRING_H 1
# | #define HAVE_MEMORY_H 1
# | #define HAVE_STRINGS_H 1
# | #define HAVE_INTTYPES_H 1
# | #define HAVE_STDINT_H 1
# | #define HAVE_UNISTD_H 1
# | #define __EXTENSIONS__ 1
# | #define _ALL_SOURCE 1
# | #define _GNU_SOURCE 1
# | #define _POSIX_PTHREAD_SEMANTICS 1
# | #define _TANDEM_SOURCE 1
# | #define HAVE_DLFCN_H 1
# | #define LT_OBJDIR ".libs/"
# | #define BUILD "x86_64-pc-linux-gnu"
# | #define HOST "x86_64-unknown-linux-gnu"
# | #define TARGET "x86_64-unknown-linux-gnu"
# | #define CA_BUNDLE "/etc/ssl/certs/ca-certificates.crt"
# | /* end confdefs.h. */
# | #include
# configure:14213: checking for ld used by clang++
# configure:14280: result: /sysroot/bin/ld -m elf_x86_64
# configure:14287: checking if the linker (/sysroot/bin/ld -m elf_x86_64) is GNU ld
# configure:14302: result: yes
# configure:14357: checking whether the clang++ linker (/sysroot/bin/ld -m elf_x86_64) supports shared libraries
# configure:15430: result: yes
# configure:15466: clang++ -c conftest.cpp >&5
# configure:15469: $? = 0
# configure:15950: checking for clang++ option to produce PIC
# configure:15957: result: -fPIC -DPIC
# configure:15965: checking if clang++ PIC flag -fPIC -DPIC works
# configure:15983: clang++ -c -fPIC -DPIC -DPIC conftest.cpp >&5
# configure:15987: $? = 0
# configure:16000: result: yes
# configure:16023: checking if clang++ static flag -static works
# configure:16051: result: no
# configure:16063: checking if clang++ supports -c -o file.o
# configure:16084: clang++ -c -o out/conftest2.o conftest.cpp >&5
# configure:16088: $? = 0
# configure:16110: result: yes
# configure:16115: checking if clang++ supports -c -o file.o
# configure:16162: result: yes
# configure:16192: checking whether the clang++ linker (/sysroot/bin/ld -m elf_x86_64) supports shared libraries
# configure:16235: result: yes
# configure:16376: checking dynamic linker characteristics
# configure:17133: result: GNU/Linux ld.so
# configure:17198: checking how to hardcode library paths into programs
# configure:17223: result: immediate
# configure:17271: checking for x86_64-unknown-linux-gcc
# configure:17298: result: clang
# configure:17567: checking for C compiler version
# configure:17576: clang --version >&5
# clang version 3.8.1
# Target: x86_64-unknown-linux-gnu
# Thread model: posix
# InstalledDir: /
# configure:17587: $? = 0
# configure:17576: clang -v >&5
# clang version 3.8.1
# Target: x86_64-unknown-linux-gnu
# Thread model: posix
# InstalledDir: /
# Found candidate GCC installation: //../lib/gcc/x86_64-pc-linux-gnu/6.1.1
# Found candidate GCC installation: //../lib64/gcc/x86_64-pc-linux-gnu/6.1.1
# Selected GCC installation: //../lib64/gcc/x86_64-pc-linux-gnu/6.1.1
# Candidate multilib: .;@m64
# Selected multilib: .;@m64
# configure:17587: $? = 0
# configure:17576: clang -V >&5
# clang-3.8: error: argument to '-V' is missing (expected 1 value)
# clang-3.8: error: no input files
# configure:17587: $? = 1
# configure:17576: clang -qversion >&5
# clang-3.8: error: unknown argument: '-qversion'
# clang-3.8: error: no input files
# configure:17587: $? = 1
# configure:17591: checking whether we are using the GNU C compiler
# configure:17619: result: yes
# configure:17628: checking whether clang accepts -g
# configure:17689: result: yes
# configure:17706: checking for clang option to accept ISO C89
# configure:17782: result: none needed
# configure:17807: checking whether clang understands -c and -o together
# configure:17844: result: yes
# configure:17863: checking dependency style of clang
# configure:17974: result: gcc3
# configure:17995: checking for bison
# configure:18011: found /usr/bin/bison
# configure:18022: result: bison -y
# configure:18043: checking dependency style of clang
# configure:18152: result: gcc3
# configure:18179: checking for x86_64-unknown-linux-ar
# configure:18206: result: ar
# configure:18280: checking for sphinx-build
# configure:18313: result: no
# configure:18335: checking for rst2html.py
# configure:18368: result: no
# configure:18335: checking for rst2html
# configure:18368: result: no
# configure:18406: checking for x86_64-unknown-linux-pkg-config
# configure:18439: result: no
# configure:18449: checking for pkg-config
# configure:18467: found /usr/bin/pkg-config
# configure:18479: result: /usr/bin/pkg-config
# configure:18504: checking pkg-config is at least version 0.20
# configure:18507: result: yes
# configure:18527: checking whether clang++ supports C++11 features by default
# configure:18558: clang++ -c conftest.cpp >&5
# conftest.cpp:41:29: error: a space is required between consecutive right angle brackets (use '> >')
# typedef check> right_angle_brackets;
# ^~
# > >
# conftest.cpp:48:15: warning: rvalue references are a C++11 extension [-Wc++11-extensions]
# check_type&& cr = static_cast(c);
# ^
# conftest.cpp:48:45: warning: rvalue references are a C++11 extension [-Wc++11-extensions]
# check_type&& cr = static_cast(c);
# ^
# conftest.cpp:50:5: warning: 'auto' type specifier is a C++11 extension [-Wc++11-extensions]
# auto d = a;
# ^
# 3 warnings and 1 error generated.
# configure:18558: $? = 1
# configure: failed program was:
# | /* confdefs.h */
# | #define PACKAGE_NAME "aria2"
# | #define PACKAGE_TARNAME "aria2"
# | #define PACKAGE_VERSION "1.24.0"
# | #define PACKAGE_STRING "aria2 1.24.0"
# | #define PACKAGE_BUGREPORT "https://github.com/aria2/aria2/issues"
# | #define PACKAGE_URL "https://aria2.github.io/"
# | #define PACKAGE "aria2"
# | #define VERSION "1.24.0"
# | #define STDC_HEADERS 1
# | #define HAVE_SYS_TYPES_H 1
# | #define HAVE_SYS_STAT_H 1
# | #define HAVE_STDLIB_H 1
# | #define HAVE_STRING_H 1
# | #define HAVE_MEMORY_H 1
# | #define HAVE_STRINGS_H 1
# | #define HAVE_INTTYPES_H 1
# | #define HAVE_STDINT_H 1
# | #define HAVE_UNISTD_H 1
# | #define __EXTENSIONS__ 1
# | #define _ALL_SOURCE 1
# | #define _GNU_SOURCE 1
# | #define _POSIX_PTHREAD_SEMANTICS 1
# | #define _TANDEM_SOURCE 1
# | #define HAVE_DLFCN_H 1
# | #define LT_OBJDIR ".libs/"
# | #define BUILD "x86_64-pc-linux-gnu"
# | #define HOST "x86_64-unknown-linux-gnu"
# | #define TARGET "x86_64-unknown-linux-gnu"
# | #define CA_BUNDLE "/etc/ssl/certs/ca-certificates.crt"
# | /* end confdefs.h. */
# |
# | #include
# |
# | template
# | struct check
# | {
# | static_assert(sizeof(int) <= sizeof(T), "not big enough");
# | };
# |
# | typedef check> right_angle_brackets;
# |
# | int a;
# | decltype(a) b;
# |
# | typedef check check_type;
# | check_type c;
# | check_type&& cr = static_cast(c);
# |
# | auto d = a;
# |
# | // Check std::shared_ptr is available, which might require -stdlib=libc++.
# | std::shared_ptr ptr;
# |
# configure:18565: result: no
# configure:18577: checking whether clang++ supports C++11 features with -std=c++11
# configure:18610: clang++ -c -std=c++11 conftest.cpp >&5
# configure:18610: $? = 0
# configure:18619: result: yes
# configure:18663: checking whether the c++ compiler supports nullptr
# configure:18679: clang++ -c -std=c++11 conftest.cpp >&5
# configure:18679: $? = 0
# configure:18692: checking whether the C++ compiler supports `override` keyword
# configure:18714: clang++ -c -std=c++11 conftest.cpp >&5
# configure:18714: $? = 0
# configure:18716: result: yes
# configure:18750: checking for ZLIB
# configure:18757: $PKG_CONFIG --exists --print-errors "zlib >= 1.2.3"
# configure:18760: $? = 0
# configure:18774: $PKG_CONFIG --exists --print-errors "zlib >= 1.2.3"
# configure:18777: $? = 0
# configure:18815: result: yes
# configure:18887: checking whether gzbuffer is declared
# configure:18887: clang++ -c conftest.cpp >&5
# conftest.cpp:34:10: fatal error: 'zlib.h' file not found
# #include
# ^
# 1 error generated.
# configure:18887: $? = 1
# configure: failed program was:
# | /* confdefs.h */
# | #define PACKAGE_NAME "aria2"
# | #define PACKAGE_TARNAME "aria2"
# | #define PACKAGE_VERSION "1.24.0"
# | #define PACKAGE_STRING "aria2 1.24.0"
# | #define PACKAGE_BUGREPORT "https://github.com/aria2/aria2/issues"
# | #define PACKAGE_URL "https://aria2.github.io/"
# | #define PACKAGE "aria2"
# | #define VERSION "1.24.0"
# | #define STDC_HEADERS 1
# | #define HAVE_SYS_TYPES_H 1
# | #define HAVE_SYS_STAT_H 1
# | #define HAVE_STDLIB_H 1
# | #define HAVE_STRING_H 1
# | #define HAVE_MEMORY_H 1
# | #define HAVE_STRINGS_H 1
# | #define HAVE_INTTYPES_H 1
# | #define HAVE_STDINT_H 1
# | #define HAVE_UNISTD_H 1
# | #define __EXTENSIONS__ 1
# | #define _ALL_SOURCE 1
# | #define _GNU_SOURCE 1
# | #define _POSIX_PTHREAD_SEMANTICS 1
# | #define _TANDEM_SOURCE 1
# | #define HAVE_DLFCN_H 1
# | #define LT_OBJDIR ".libs/"
# | #define BUILD "x86_64-pc-linux-gnu"
# | #define HOST "x86_64-unknown-linux-gnu"
# | #define TARGET "x86_64-unknown-linux-gnu"
# | #define CA_BUNDLE "/etc/ssl/certs/ca-certificates.crt"
# | #define CXX11_OVERRIDE override
# | #define HAVE_ZLIB 1
# | /* end confdefs.h. */
# | #include
# |
# | int
# | main ()
# | {
# | #ifndef gzbuffer
# | #ifdef __cplusplus
# | (void) gzbuffer;
# | #else
# | (void) gzbuffer;
# | #endif
# | #endif
# |
# | ;
# | return 0;
# | }
# configure:18887: result: no
# configure:18902: checking for gzsetparams
# configure:18902: clang++ -o conftest conftest.cpp -lz >&5
# /sysroot/bin/ld: error: cannot find -lz
# /tmp/conftest-29b1c5.o:conftest.cpp:function main: error: undefined reference to 'gzsetparams'
# clang-3.8: error: linker command failed with exit code 1 (use -v to see invocation)
# configure:18902: $? = 1
# configure: failed program was:
# | /* confdefs.h */
# | #define PACKAGE_NAME "aria2"
# | #define PACKAGE_TARNAME "aria2"
# | #define PACKAGE_VERSION "1.24.0"
# | #define PACKAGE_STRING "aria2 1.24.0"
# | #define PACKAGE_BUGREPORT "https://github.com/aria2/aria2/issues"
# | #define PACKAGE_URL "https://aria2.github.io/"
# | #define PACKAGE "aria2"
# | #define VERSION "1.24.0"
# | #define STDC_HEADERS 1
# | #define HAVE_SYS_TYPES_H 1
# | #define HAVE_SYS_STAT_H 1
# | #define HAVE_STDLIB_H 1
# | #define HAVE_STRING_H 1
# | #define HAVE_MEMORY_H 1
# | #define HAVE_STRINGS_H 1
# | #define HAVE_INTTYPES_H 1
# | #define HAVE_STDINT_H 1
# | #define HAVE_UNISTD_H 1
# | #define __EXTENSIONS__ 1
# | #define _ALL_SOURCE 1
# | #define _GNU_SOURCE 1
# | #define _POSIX_PTHREAD_SEMANTICS 1
# | #define _TANDEM_SOURCE 1
# | #define HAVE_DLFCN_H 1
# | #define LT_OBJDIR ".libs/"
# | #define BUILD "x86_64-pc-linux-gnu"
# | #define HOST "x86_64-unknown-linux-gnu"
# | #define TARGET "x86_64-unknown-linux-gnu"
# | #define CA_BUNDLE "/etc/ssl/certs/ca-certificates.crt"
# | #define CXX11_OVERRIDE override
# | #define HAVE_ZLIB 1
# | /* end confdefs.h. */
# | /* Define gzsetparams to an innocuous variant, in case declares gzsetparams.
# | For example, HP-UX 11i declares gettimeofday. */
# | #define gzsetparams innocuous_gzsetparams
# |
# | /* System header to define __stub macros and hopefully few prototypes,
# | which can conflict with char gzsetparams (); below.
# | Prefer to if __STDC__ is defined, since
# | exists even on freestanding compilers. */
# |
# | #ifdef __STDC__
# | # include
# | #else
# | # include
# | #endif
# |
# | #undef gzsetparams
# |
# | /* Override any GCC internal prototype to avoid an error.
# | Use char because int might match the return type of a GCC
# | builtin and then its argument prototype would still apply. */
# | #ifdef __cplusplus
# | extern "C"
# | #endif
# | char gzsetparams ();
# | /* The GNU C library defines this for functions which it implements
# | to always fail with ENOSYS. Some functions are actually named
# | something starting with __ and the normal name is an alias. */
# | #if defined __stub_gzsetparams || defined __stub___gzsetparams
# | choke me
# | #endif
# |
# | int
# | main ()
# | {
# | return gzsetparams ();
# | ;
# | return 0;
# | }
# configure:18902: result: no
# configure:19207: checking for xml2-config
# configure:19225: found /usr/bin/xml2-config
# configure:19238: result: /usr/bin/xml2-config
# configure:19247: checking for libxml - version >= 2.6.24
# configure:19349: clang++ -o conftest -I/usr/include/libxml2 conftest.cpp -lxml2 -lz -llzma -lm -ldl >&5
# /sysroot/bin/ld: error: cannot find -lxml2
# /sysroot/bin/ld: error: cannot find -lz
# /sysroot/bin/ld: error: cannot find -llzma
# /tmp/conftest-e13534.o:conftest.cpp:function main: error: undefined reference to 'xmlCheckVersion'
# clang-3.8: error: linker command failed with exit code 1 (use -v to see invocation)
# configure:19349: $? = 1
# configure: program exited with status 1
# configure: failed program was:
# | /* confdefs.h */
# | #define PACKAGE_NAME "aria2"
# | #define PACKAGE_TARNAME "aria2"
# | #define PACKAGE_VERSION "1.24.0"
# | #define PACKAGE_STRING "aria2 1.24.0"
# | #define PACKAGE_BUGREPORT "https://github.com/aria2/aria2/issues"
# | #define PACKAGE_URL "https://aria2.github.io/"
# | #define PACKAGE "aria2"
# | #define VERSION "1.24.0"
# | #define STDC_HEADERS 1
# | #define HAVE_SYS_TYPES_H 1
# | #define HAVE_SYS_STAT_H 1
# | #define HAVE_STDLIB_H 1
# | #define HAVE_STRING_H 1
# | #define HAVE_MEMORY_H 1
# | #define HAVE_STRINGS_H 1
# | #define HAVE_INTTYPES_H 1
# | #define HAVE_STDINT_H 1
# | #define HAVE_UNISTD_H 1
# | #define __EXTENSIONS__ 1
# | #define _ALL_SOURCE 1
# | #define _GNU_SOURCE 1
# | #define _POSIX_PTHREAD_SEMANTICS 1
# | #define _TANDEM_SOURCE 1
# | #define HAVE_DLFCN_H 1
# | #define LT_OBJDIR ".libs/"
# | #define BUILD "x86_64-pc-linux-gnu"
# | #define HOST "x86_64-unknown-linux-gnu"
# | #define TARGET "x86_64-unknown-linux-gnu"
# | #define CA_BUNDLE "/etc/ssl/certs/ca-certificates.crt"
# | #define CXX11_OVERRIDE override
# | #define HAVE_ZLIB 1
# | /* end confdefs.h. */
# |
# | #include
# | #include
# | #include
# | #include
# |
# | int
# | main()
# | {
# | int xml_major_version, xml_minor_version, xml_micro_version;
# | int major, minor, micro;
# | char *tmp_version;
# |
# | system("touch conf.xmltest");
# |
# | /* Capture xml2-config output via autoconf/configure variables */
# | /* HP/UX 9 (%@#!) writes to sscanf strings */
# | tmp_version = (char *)strdup("2.6.24");
# | if (sscanf(tmp_version, "%d.%d.%d", &major, &minor, µ) != 3) {
# | printf("%s, bad version string from xml2-config\n", "2.6.24");
# | exit(1);
# | }
# | free(tmp_version);
# |
# | /* Capture the version information from the header files */
# | tmp_version = (char *)strdup(LIBXML_DOTTED_VERSION);
# | if (sscanf(tmp_version, "%d.%d.%d", &xml_major_version, &xml_minor_version, &xml_micro_version) != 3) {
# | printf("%s, bad version string from libxml includes\n", "LIBXML_DOTTED_VERSION");
# | exit(1);
# | }
# | free(tmp_version);
# |
# | /* Compare xml2-config output to the libxml headers */
# | if ((xml_major_version != 2) ||
# | (xml_minor_version != 9) ||
# | (xml_micro_version != 4))
# | {
# | printf("*** libxml header files (version %d.%d.%d) do not match\n",
# | xml_major_version, xml_minor_version, xml_micro_version);
# | printf("*** xml2-config (version %d.%d.%d)\n",
# | 2, 9, 4);
# | return 1;
# | }
# | /* Compare the headers to the library to make sure we match */
# | /* Less than ideal -- doesn't provide us with return value feedback,
# | * only exits if there's a serious mismatch between header and library.
# | */
# | LIBXML_TEST_VERSION;
# |
# | /* Test that the library is greater than our minimum version */
# | if ((xml_major_version > major) ||
# | ((xml_major_version == major) && (xml_minor_version > minor)) ||
# | ((xml_major_version == major) && (xml_minor_version == minor) &&
# | (xml_micro_version >= micro)))
# | {
# | return 0;
# | }
# | else
# | {
# | printf("\n*** An old version of libxml (%d.%d.%d) was found.\n",
# | xml_major_version, xml_minor_version, xml_micro_version);
# | printf("*** You need a version of libxml newer than %d.%d.%d. The latest version of\n",
# | major, minor, micro);
# | printf("*** libxml is always available from ftp://ftp.xmlsoft.org.\n");
# | printf("***\n");
# | printf("*** If you have already installed a sufficiently new version, this error\n");
# | printf("*** probably means that the wrong copy of the xml2-config shell script is\n");
# | printf("*** being found. The easiest way to fix this is to remove the old version\n");
# | printf("*** of LIBXML, but you can also set the XML2_CONFIG environment to point to the\n");
# | printf("*** correct copy of xml2-config. (In this case, you will have to\n");
# | printf("*** modify your LD_LIBRARY_PATH enviroment variable, or edit /etc/ld.so.conf\n");
# | printf("*** so that the correct libraries are found at run-time))\n");
# | }
# | return 1;
# | }
# |
# configure:19368: result: no
# configure:19396: clang++ -o conftest -I/usr/include/libxml2 conftest.cpp -lxml2 -lz -llzma -lm -ldl >&5
# /sysroot/bin/ld: error: cannot find -lxml2
# /sysroot/bin/ld: error: cannot find -lz
# /sysroot/bin/ld: error: cannot find -llzma
# /tmp/conftest-838f13.o:conftest.cpp:function main: error: undefined reference to 'xmlCheckVersion'
# clang-3.8: error: linker command failed with exit code 1 (use -v to see invocation)
# configure:19396: $? = 1
# configure: failed program was:
# | /* confdefs.h */
# | #define PACKAGE_NAME "aria2"
# | #define PACKAGE_TARNAME "aria2"
# | #define PACKAGE_VERSION "1.24.0"
# | #define PACKAGE_STRING "aria2 1.24.0"
# | #define PACKAGE_BUGREPORT "https://github.com/aria2/aria2/issues"
# | #define PACKAGE_URL "https://aria2.github.io/"
# | #define PACKAGE "aria2"
# | #define VERSION "1.24.0"
# | #define STDC_HEADERS 1
# | #define HAVE_SYS_TYPES_H 1
# | #define HAVE_SYS_STAT_H 1
# | #define HAVE_STDLIB_H 1
# | #define HAVE_STRING_H 1
# | #define HAVE_MEMORY_H 1
# | #define HAVE_STRINGS_H 1
# | #define HAVE_INTTYPES_H 1
# | #define HAVE_STDINT_H 1
# | #define HAVE_UNISTD_H 1
# | #define __EXTENSIONS__ 1
# | #define _ALL_SOURCE 1
# | #define _GNU_SOURCE 1
# | #define _POSIX_PTHREAD_SEMANTICS 1
# | #define _TANDEM_SOURCE 1
# | #define HAVE_DLFCN_H 1
# | #define LT_OBJDIR ".libs/"
# | #define BUILD "x86_64-pc-linux-gnu"
# | #define HOST "x86_64-unknown-linux-gnu"
# | #define TARGET "x86_64-unknown-linux-gnu"
# | #define CA_BUNDLE "/etc/ssl/certs/ca-certificates.crt"
# | #define CXX11_OVERRIDE override
# | #define HAVE_ZLIB 1
# | /* end confdefs.h. */
# |
# | #include
# | #include
# |
# | int
# | main ()
# | {
# | LIBXML_TEST_VERSION; return 0;
# | ;
# | return 0;
# | }
# configure:19446: checking for XML_ParserCreate in -lexpat
# configure:19471: clang++ -o conftest conftest.cpp -lexpat -lexpat >&5
# /sysroot/bin/ld: error: cannot find -lexpat
# /sysroot/bin/ld: error: cannot find -lexpat
# /tmp/conftest-e47a46.o:conftest.cpp:function main: error: undefined reference to 'XML_ParserCreate'
# clang-3.8: error: linker command failed with exit code 1 (use -v to see invocation)
# configure:19471: $? = 1
# configure: failed program was:
# | /* confdefs.h */
# | #define PACKAGE_NAME "aria2"
# | #define PACKAGE_TARNAME "aria2"
# | #define PACKAGE_VERSION "1.24.0"
# | #define PACKAGE_STRING "aria2 1.24.0"
# | #define PACKAGE_BUGREPORT "https://github.com/aria2/aria2/issues"
# | #define PACKAGE_URL "https://aria2.github.io/"
# | #define PACKAGE "aria2"
# | #define VERSION "1.24.0"
# | #define STDC_HEADERS 1
# | #define HAVE_SYS_TYPES_H 1
# | #define HAVE_SYS_STAT_H 1
# | #define HAVE_STDLIB_H 1
# | #define HAVE_STRING_H 1
# | #define HAVE_MEMORY_H 1
# | #define HAVE_STRINGS_H 1
# | #define HAVE_INTTYPES_H 1
# | #define HAVE_STDINT_H 1
# | #define HAVE_UNISTD_H 1
# | #define __EXTENSIONS__ 1
# | #define _ALL_SOURCE 1
# | #define _GNU_SOURCE 1
# | #define _POSIX_PTHREAD_SEMANTICS 1
# | #define _TANDEM_SOURCE 1
# | #define HAVE_DLFCN_H 1
# | #define LT_OBJDIR ".libs/"
# | #define BUILD "x86_64-pc-linux-gnu"
# | #define HOST "x86_64-unknown-linux-gnu"
# | #define TARGET "x86_64-unknown-linux-gnu"
# | #define CA_BUNDLE "/etc/ssl/certs/ca-certificates.crt"
# | #define CXX11_OVERRIDE override
# | #define HAVE_ZLIB 1
# | /* end confdefs.h. */
# |
# | /* Override any GCC internal prototype to avoid an error.
# | Use char because int might match the return type of a GCC
# | builtin and then its argument prototype would still apply. */
# | #ifdef __cplusplus
# | extern "C"
# | #endif
# | char XML_ParserCreate ();
# | int
# | main ()
# | {
# | return XML_ParserCreate ();
# | ;
# | return 0;
# | }
# configure:19480: result: no
# configure:19513: checking for SQLITE3
# configure:19520: $PKG_CONFIG --exists --print-errors "sqlite3"
# configure:19523: $? = 0
# configure:19537: $PKG_CONFIG --exists --print-errors "sqlite3"
# configure:19540: $? = 0
# configure:19578: result: yes
# configure:19590: checking for sqlite3_open_v2
# configure:19590: clang++ -o conftest conftest.cpp -lsqlite3 >&5
# /sysroot/bin/ld: error: cannot find -lsqlite3
# /tmp/conftest-d46011.o:conftest.cpp:function main: error: undefined reference to 'sqlite3_open_v2'
# clang-3.8: error: linker command failed with exit code 1 (use -v to see invocation)
# configure:19590: $? = 1
# configure: failed program was:
# | /* confdefs.h */
# | #define PACKAGE_NAME "aria2"
# | #define PACKAGE_TARNAME "aria2"
# | #define PACKAGE_VERSION "1.24.0"
# | #define PACKAGE_STRING "aria2 1.24.0"
# | #define PACKAGE_BUGREPORT "https://github.com/aria2/aria2/issues"
# | #define PACKAGE_URL "https://aria2.github.io/"
# | #define PACKAGE "aria2"
# | #define VERSION "1.24.0"
# | #define STDC_HEADERS 1
# | #define HAVE_SYS_TYPES_H 1
# | #define HAVE_SYS_STAT_H 1
# | #define HAVE_STDLIB_H 1
# | #define HAVE_STRING_H 1
# | #define HAVE_MEMORY_H 1
# | #define HAVE_STRINGS_H 1
# | #define HAVE_INTTYPES_H 1
# | #define HAVE_STDINT_H 1
# | #define HAVE_UNISTD_H 1
# | #define __EXTENSIONS__ 1
# | #define _ALL_SOURCE 1
# | #define _GNU_SOURCE 1
# | #define _POSIX_PTHREAD_SEMANTICS 1
# | #define _TANDEM_SOURCE 1
# | #define HAVE_DLFCN_H 1
# | #define LT_OBJDIR ".libs/"
# | #define BUILD "x86_64-pc-linux-gnu"
# | #define HOST "x86_64-unknown-linux-gnu"
# | #define TARGET "x86_64-unknown-linux-gnu"
# | #define CA_BUNDLE "/etc/ssl/certs/ca-certificates.crt"
# | #define CXX11_OVERRIDE override
# | #define HAVE_ZLIB 1
# | #define HAVE_SQLITE3 1
# | /* end confdefs.h. */
# | /* Define sqlite3_open_v2 to an innocuous variant, in case declares sqlite3_open_v2.
# | For example, HP-UX 11i declares gettimeofday. */
# | #define sqlite3_open_v2 innocuous_sqlite3_open_v2
# |
# | /* System header to define __stub macros and hopefully few prototypes,
# | which can conflict with char sqlite3_open_v2 (); below.
# | Prefer to if __STDC__ is defined, since
# | exists even on freestanding compilers. */
# |
# | #ifdef __STDC__
# | # include
# | #else
# | # include
# | #endif
# |
# | #undef sqlite3_open_v2
# |
# | /* Override any GCC internal prototype to avoid an error.
# | Use char because int might match the return type of a GCC
# | builtin and then its argument prototype would still apply. */
# | #ifdef __cplusplus
# | extern "C"
# | #endif
# | char sqlite3_open_v2 ();
# | /* The GNU C library defines this for functions which it implements
# | to always fail with ENOSYS. Some functions are actually named
# | something starting with __ and the normal name is an alias. */
# | #if defined __stub_sqlite3_open_v2 || defined __stub___sqlite3_open_v2
# | choke me
# | #endif
# |
# | int
# | main ()
# | {
# | return sqlite3_open_v2 ();
# | ;
# | return 0;
# | }
# configure:19590: result: no
# configure:19663: checking whether to enable Mac OS X native SSL/TLS
# configure:19677: result: no
# configure:19690: checking for main in -lcrypt32
# configure:19709: clang++ -o conftest conftest.cpp -lcrypt32 >&5
# /sysroot/bin/ld: error: cannot find -lcrypt32
# clang-3.8: error: linker command failed with exit code 1 (use -v to see invocation)
# configure:19709: $? = 1
# configure: failed program was:
# | /* confdefs.h */
# | #define PACKAGE_NAME "aria2"
# | #define PACKAGE_TARNAME "aria2"
# | #define PACKAGE_VERSION "1.24.0"
# | #define PACKAGE_STRING "aria2 1.24.0"
# | #define PACKAGE_BUGREPORT "https://github.com/aria2/aria2/issues"
# | #define PACKAGE_URL "https://aria2.github.io/"
# | #define PACKAGE "aria2"
# | #define VERSION "1.24.0"
# | #define STDC_HEADERS 1
# | #define HAVE_SYS_TYPES_H 1
# | #define HAVE_SYS_STAT_H 1
# | #define HAVE_STDLIB_H 1
# | #define HAVE_STRING_H 1
# | #define HAVE_MEMORY_H 1
# | #define HAVE_STRINGS_H 1
# | #define HAVE_INTTYPES_H 1
# | #define HAVE_STDINT_H 1
# | #define HAVE_UNISTD_H 1
# | #define __EXTENSIONS__ 1
# | #define _ALL_SOURCE 1
# | #define _GNU_SOURCE 1
# | #define _POSIX_PTHREAD_SEMANTICS 1
# | #define _TANDEM_SOURCE 1
# | #define HAVE_DLFCN_H 1
# | #define LT_OBJDIR ".libs/"
# | #define BUILD "x86_64-pc-linux-gnu"
# | #define HOST "x86_64-unknown-linux-gnu"
# | #define TARGET "x86_64-unknown-linux-gnu"
# | #define CA_BUNDLE "/etc/ssl/certs/ca-certificates.crt"
# | #define CXX11_OVERRIDE override
# | #define HAVE_ZLIB 1
# | #define HAVE_SQLITE3 1
# | /* end confdefs.h. */
# |
# |
# | int
# | main ()
# | {
# | return main ();
# | ;
# | return 0;
# | }
# configure:19718: result: no
# configure:19727: checking for main in -lsecur32
# configure:19746: clang++ -o conftest conftest.cpp -lsecur32 >&5
# /sysroot/bin/ld: error: cannot find -lsecur32
# clang-3.8: error: linker command failed with exit code 1 (use -v to see invocation)
# configure:19746: $? = 1
# configure: failed program was:
# | /* confdefs.h */
# | #define PACKAGE_NAME "aria2"
# | #define PACKAGE_TARNAME "aria2"
# | #define PACKAGE_VERSION "1.24.0"
# | #define PACKAGE_STRING "aria2 1.24.0"
# | #define PACKAGE_BUGREPORT "https://github.com/aria2/aria2/issues"
# | #define PACKAGE_URL "https://aria2.github.io/"
# | #define PACKAGE "aria2"
# | #define VERSION "1.24.0"
# | #define STDC_HEADERS 1
# | #define HAVE_SYS_TYPES_H 1
# | #define HAVE_SYS_STAT_H 1
# | #define HAVE_STDLIB_H 1
# | #define HAVE_STRING_H 1
# | #define HAVE_MEMORY_H 1
# | #define HAVE_STRINGS_H 1
# | #define HAVE_INTTYPES_H 1
# | #define HAVE_STDINT_H 1
# | #define HAVE_UNISTD_H 1
# | #define __EXTENSIONS__ 1
# | #define _ALL_SOURCE 1
# | #define _GNU_SOURCE 1
# | #define _POSIX_PTHREAD_SEMANTICS 1
# | #define _TANDEM_SOURCE 1
# | #define HAVE_DLFCN_H 1
# | #define LT_OBJDIR ".libs/"
# | #define BUILD "x86_64-pc-linux-gnu"
# | #define HOST "x86_64-unknown-linux-gnu"
# | #define TARGET "x86_64-unknown-linux-gnu"
# | #define CA_BUNDLE "/etc/ssl/certs/ca-certificates.crt"
# | #define CXX11_OVERRIDE override
# | #define HAVE_ZLIB 1
# | #define HAVE_SQLITE3 1
# | /* end confdefs.h. */
# |
# |
# | int
# | main ()
# | {
# | return main ();
# | ;
# | return 0;
# | }
# configure:19755: result: no
# configure:19764: checking for main in -ladvapi32
# configure:19783: clang++ -o conftest conftest.cpp -ladvapi32 >&5
# /sysroot/bin/ld: error: cannot find -ladvapi32
# clang-3.8: error: linker command failed with exit code 1 (use -v to see invocation)
# configure:19783: $? = 1
# configure: failed program was:
# | /* confdefs.h */
# | #define PACKAGE_NAME "aria2"
# | #define PACKAGE_TARNAME "aria2"
# | #define PACKAGE_VERSION "1.24.0"
# | #define PACKAGE_STRING "aria2 1.24.0"
# | #define PACKAGE_BUGREPORT "https://github.com/aria2/aria2/issues"
# | #define PACKAGE_URL "https://aria2.github.io/"
# | #define PACKAGE "aria2"
# | #define VERSION "1.24.0"
# | #define STDC_HEADERS 1
# | #define HAVE_SYS_TYPES_H 1
# | #define HAVE_SYS_STAT_H 1
# | #define HAVE_STDLIB_H 1
# | #define HAVE_STRING_H 1
# | #define HAVE_MEMORY_H 1
# | #define HAVE_STRINGS_H 1
# | #define HAVE_INTTYPES_H 1
# | #define HAVE_STDINT_H 1
# | #define HAVE_UNISTD_H 1
# | #define __EXTENSIONS__ 1
# | #define _ALL_SOURCE 1
# | #define _GNU_SOURCE 1
# | #define _POSIX_PTHREAD_SEMANTICS 1
# | #define _TANDEM_SOURCE 1
# | #define HAVE_DLFCN_H 1
# | #define LT_OBJDIR ".libs/"
# | #define BUILD "x86_64-pc-linux-gnu"
# | #define HOST "x86_64-unknown-linux-gnu"
# | #define TARGET "x86_64-unknown-linux-gnu"
# | #define CA_BUNDLE "/etc/ssl/certs/ca-certificates.crt"
# | #define CXX11_OVERRIDE override
# | #define HAVE_ZLIB 1
# | #define HAVE_SQLITE3 1
# | /* end confdefs.h. */
# |
# |
# | int
# | main ()
# | {
# | return main ();
# | ;
# | return 0;
# | }
# configure:19792: result: no
# configure:19801: checking for wincrypt.h
# configure:19801: clang++ -c conftest.cpp >&5
# conftest.cpp:41:10: fatal error: 'wincrypt.h' file not found
# #include
# ^
# 1 error generated.
# configure:19801: $? = 1
# configure: failed program was:
# | /* confdefs.h */
# | #define PACKAGE_NAME "aria2"
# | #define PACKAGE_TARNAME "aria2"
# | #define PACKAGE_VERSION "1.24.0"
# | #define PACKAGE_STRING "aria2 1.24.0"
# | #define PACKAGE_BUGREPORT "https://github.com/aria2/aria2/issues"
# | #define PACKAGE_URL "https://aria2.github.io/"
# | #define PACKAGE "aria2"
# | #define VERSION "1.24.0"
# | #define STDC_HEADERS 1
# | #define HAVE_SYS_TYPES_H 1
# | #define HAVE_SYS_STAT_H 1
# | #define HAVE_STDLIB_H 1
# | #define HAVE_STRING_H 1
# | #define HAVE_MEMORY_H 1
# | #define HAVE_STRINGS_H 1
# | #define HAVE_INTTYPES_H 1
# | #define HAVE_STDINT_H 1
# | #define HAVE_UNISTD_H 1
# | #define __EXTENSIONS__ 1
# | #define _ALL_SOURCE 1
# | #define _GNU_SOURCE 1
# | #define _POSIX_PTHREAD_SEMANTICS 1
# | #define _TANDEM_SOURCE 1
# | #define HAVE_DLFCN_H 1
# | #define LT_OBJDIR ".libs/"
# | #define BUILD "x86_64-pc-linux-gnu"
# | #define HOST "x86_64-unknown-linux-gnu"
# | #define TARGET "x86_64-unknown-linux-gnu"
# | #define CA_BUNDLE "/etc/ssl/certs/ca-certificates.crt"
# | #define CXX11_OVERRIDE override
# | #define HAVE_ZLIB 1
# | #define HAVE_SQLITE3 1
# | /* end confdefs.h. */
# |
# | #ifdef HAVE_WINDOWS_H
# | # include
# | #endif
# |
# |
# | #include
# configure:19801: result: no
# configure:19814: checking for security.h
# configure:19814: clang++ -c conftest.cpp >&5
# conftest.cpp:44:10: fatal error: 'security.h' file not found
# #include
# ^
# 1 error generated.
# configure:19814: $? = 1
# configure: failed program was:
# | /* confdefs.h */
# | #define PACKAGE_NAME "aria2"
# | #define PACKAGE_TARNAME "aria2"
# | #define PACKAGE_VERSION "1.24.0"
# | #define PACKAGE_STRING "aria2 1.24.0"
# | #define PACKAGE_BUGREPORT "https://github.com/aria2/aria2/issues"
# | #define PACKAGE_URL "https://aria2.github.io/"
# | #define PACKAGE "aria2"
# | #define VERSION "1.24.0"
# | #define STDC_HEADERS 1
# | #define HAVE_SYS_TYPES_H 1
# | #define HAVE_SYS_STAT_H 1
# | #define HAVE_STDLIB_H 1
# | #define HAVE_STRING_H 1
# | #define HAVE_MEMORY_H 1
# | #define HAVE_STRINGS_H 1
# | #define HAVE_INTTYPES_H 1
# | #define HAVE_STDINT_H 1
# | #define HAVE_UNISTD_H 1
# | #define __EXTENSIONS__ 1
# | #define _ALL_SOURCE 1
# | #define _GNU_SOURCE 1
# | #define _POSIX_PTHREAD_SEMANTICS 1
# | #define _TANDEM_SOURCE 1
# | #define HAVE_DLFCN_H 1
# | #define LT_OBJDIR ".libs/"
# | #define BUILD "x86_64-pc-linux-gnu"
# | #define HOST "x86_64-unknown-linux-gnu"
# | #define TARGET "x86_64-unknown-linux-gnu"
# | #define CA_BUNDLE "/etc/ssl/certs/ca-certificates.crt"
# | #define CXX11_OVERRIDE override
# | #define HAVE_ZLIB 1
# | #define HAVE_SQLITE3 1
# | /* end confdefs.h. */
# |
# | #ifdef HAVE_WINDOWS_H
# | # include
# | #endif
# | #ifndef SECURITY_WIN32
# | #define SECURITY_WIN32 1
# | #endif
# |
# |
# | #include
# configure:19814: result: no
# configure:19860: checking for LIBGNUTLS
# configure:19867: $PKG_CONFIG --exists --print-errors "gnutls >= 2.2.0"
# configure:19870: $? = 0
# configure:19884: $PKG_CONFIG --exists --print-errors "gnutls >= 2.2.0"
# configure:19887: $? = 0
# configure:19925: result: yes
# configure:19938: checking for gnutls_certificate_set_x509_system_trust
# configure:19938: clang++ -o conftest conftest.cpp -lgnutls >&5
# /sysroot/bin/ld: error: cannot find -lgnutls
# /tmp/conftest-c884cf.o:conftest.cpp:function main: error: undefined reference to 'gnutls_certificate_set_x509_system_trust'
# clang-3.8: error: linker command failed with exit code 1 (use -v to see invocation)
# configure:19938: $? = 1
# configure: failed program was:
# | /* confdefs.h */
# | #define PACKAGE_NAME "aria2"
# | #define PACKAGE_TARNAME "aria2"
# | #define PACKAGE_VERSION "1.24.0"
# | #define PACKAGE_STRING "aria2 1.24.0"
# | #define PACKAGE_BUGREPORT "https://github.com/aria2/aria2/issues"
# | #define PACKAGE_URL "https://aria2.github.io/"
# | #define PACKAGE "aria2"
# | #define VERSION "1.24.0"
# | #define STDC_HEADERS 1
# | #define HAVE_SYS_TYPES_H 1
# | #define HAVE_SYS_STAT_H 1
# | #define HAVE_STDLIB_H 1
# | #define HAVE_STRING_H 1
# | #define HAVE_MEMORY_H 1
# | #define HAVE_STRINGS_H 1
# | #define HAVE_INTTYPES_H 1
# | #define HAVE_STDINT_H 1
# | #define HAVE_UNISTD_H 1
# | #define __EXTENSIONS__ 1
# | #define _ALL_SOURCE 1
# | #define _GNU_SOURCE 1
# | #define _POSIX_PTHREAD_SEMANTICS 1
# | #define _TANDEM_SOURCE 1
# | #define HAVE_DLFCN_H 1
# | #define LT_OBJDIR ".libs/"
# | #define BUILD "x86_64-pc-linux-gnu"
# | #define HOST "x86_64-unknown-linux-gnu"
# | #define TARGET "x86_64-unknown-linux-gnu"
# | #define CA_BUNDLE "/etc/ssl/certs/ca-certificates.crt"
# | #define CXX11_OVERRIDE override
# | #define HAVE_ZLIB 1
# | #define HAVE_SQLITE3 1
# | #define HAVE_LIBGNUTLS 1
# | /* end confdefs.h. */
# | /* Define gnutls_certificate_set_x509_system_trust to an innocuous variant, in case declares gnutls_certificate_set_x509_system_trust.
# | For example, HP-UX 11i declares gettimeofday. */
# | #define gnutls_certificate_set_x509_system_trust innocuous_gnutls_certificate_set_x509_system_trust
# |
# | /* System header to define __stub macros and hopefully few prototypes,
# | which can conflict with char gnutls_certificate_set_x509_system_trust (); below.
# | Prefer to if __STDC__ is defined, since
# | exists even on freestanding compilers. */
# |
# | #ifdef __STDC__
# | # include
# | #else
# | # include
# | #endif
# |
# | #undef gnutls_certificate_set_x509_system_trust
# |
# | /* Override any GCC internal prototype to avoid an error.
# | Use char because int might match the return type of a GCC
# | builtin and then its argument prototype would still apply. */
# | #ifdef __cplusplus
# | extern "C"
# | #endif
# | char gnutls_certificate_set_x509_system_trust ();
# | /* The GNU C library defines this for functions which it implements
# | to always fail with ENOSYS. Some functions are actually named
# | something starting with __ and the normal name is an alias. */
# | #if defined __stub_gnutls_certificate_set_x509_system_trust || defined __stub___gnutls_certificate_set_x509_system_trust
# | choke me
# | #endif
# |
# | int
# | main ()
# | {
# | return gnutls_certificate_set_x509_system_trust ();
# | ;
# | return 0;
# | }
# configure:19938: result: no
# configure:20120: checking for nettle_sha1_init in -lnettle
# configure:20145: clang++ -o conftest conftest.cpp -lnettle >&5
# /sysroot/bin/ld: error: cannot find -lnettle
# /tmp/conftest-8364a3.o:conftest.cpp:function main: error: undefined reference to 'nettle_sha1_init'
# clang-3.8: error: linker command failed with exit code 1 (use -v to see invocation)
# configure:20145: $? = 1
# configure: failed program was:
# | /* confdefs.h */
# | #define PACKAGE_NAME "aria2"
# | #define PACKAGE_TARNAME "aria2"
# | #define PACKAGE_VERSION "1.24.0"
# | #define PACKAGE_STRING "aria2 1.24.0"
# | #define PACKAGE_BUGREPORT "https://github.com/aria2/aria2/issues"
# | #define PACKAGE_URL "https://aria2.github.io/"
# | #define PACKAGE "aria2"
# | #define VERSION "1.24.0"
# | #define STDC_HEADERS 1
# | #define HAVE_SYS_TYPES_H 1
# | #define HAVE_SYS_STAT_H 1
# | #define HAVE_STDLIB_H 1
# | #define HAVE_STRING_H 1
# | #define HAVE_MEMORY_H 1
# | #define HAVE_STRINGS_H 1
# | #define HAVE_INTTYPES_H 1
# | #define HAVE_STDINT_H 1
# | #define HAVE_UNISTD_H 1
# | #define __EXTENSIONS__ 1
# | #define _ALL_SOURCE 1
# | #define _GNU_SOURCE 1
# | #define _POSIX_PTHREAD_SEMANTICS 1
# | #define _TANDEM_SOURCE 1
# | #define HAVE_DLFCN_H 1
# | #define LT_OBJDIR ".libs/"
# | #define BUILD "x86_64-pc-linux-gnu"
# | #define HOST "x86_64-unknown-linux-gnu"
# | #define TARGET "x86_64-unknown-linux-gnu"
# | #define CA_BUNDLE "/etc/ssl/certs/ca-certificates.crt"
# | #define CXX11_OVERRIDE override
# | #define HAVE_ZLIB 1
# | #define HAVE_SQLITE3 1
# | #define HAVE_LIBGNUTLS 1
# | /* end confdefs.h. */
# |
# | /* Override any GCC internal prototype to avoid an error.
# | Use char because int might match the return type of a GCC
# | builtin and then its argument prototype would still apply. */
# | #ifdef __cplusplus
# | extern "C"
# | #endif
# | char nettle_sha1_init ();
# | int
# | main ()
# | {
# | return nettle_sha1_init ();
# | ;
# | return 0;
# | }
# configure:20154: result: no
# configure:20290: checking for libgcrypt-config
# configure:20308: found /usr/bin/libgcrypt-config
# configure:20321: result: /usr/bin/libgcrypt-config
# configure:20338: checking for LIBGCRYPT - version >= 1.2.4
# configure:20372: result: yes (1.7.1)
# configure:20443: checking for LIBSSH2
# configure:20450: $PKG_CONFIG --exists --print-errors "libssh2"
# configure:20453: $? = 0
# configure:20467: $PKG_CONFIG --exists --print-errors "libssh2"
# configure:20470: $? = 0
# configure:20508: result: yes
# configure:20532: checking for LIBCARES
# configure:20539: $PKG_CONFIG --exists --print-errors "libcares >= 1.7.0"
# configure:20542: $? = 0
# configure:20556: $PKG_CONFIG --exists --print-errors "libcares >= 1.7.0"
# configure:20559: $? = 0
# configure:20597: result: yes
# configure:20609: checking for ares_addr_node
# configure:20609: clang++ -c conftest.cpp >&5
# configure:20609: $? = 0
# configure:20609: clang++ -c conftest.cpp >&5
# conftest.cpp:44:29: error: expected expression
# if (sizeof ((ares_addr_node)))
# ^
# 1 error generated.
# configure:20609: $? = 1
# configure: failed program was:
# | /* confdefs.h */
# | #define PACKAGE_NAME "aria2"
# | #define PACKAGE_TARNAME "aria2"
# | #define PACKAGE_VERSION "1.24.0"
# | #define PACKAGE_STRING "aria2 1.24.0"
# | #define PACKAGE_BUGREPORT "https://github.com/aria2/aria2/issues"
# | #define PACKAGE_URL "https://aria2.github.io/"
# | #define PACKAGE "aria2"
# | #define VERSION "1.24.0"
# | #define STDC_HEADERS 1
# | #define HAVE_SYS_TYPES_H 1
# | #define HAVE_SYS_STAT_H 1
# | #define HAVE_STDLIB_H 1
# | #define HAVE_STRING_H 1
# | #define HAVE_MEMORY_H 1
# | #define HAVE_STRINGS_H 1
# | #define HAVE_INTTYPES_H 1
# | #define HAVE_STDINT_H 1
# | #define HAVE_UNISTD_H 1
# | #define __EXTENSIONS__ 1
# | #define _ALL_SOURCE 1
# | #define _GNU_SOURCE 1
# | #define _POSIX_PTHREAD_SEMANTICS 1
# | #define _TANDEM_SOURCE 1
# | #define HAVE_DLFCN_H 1
# | #define LT_OBJDIR ".libs/"
# | #define BUILD "x86_64-pc-linux-gnu"
# | #define HOST "x86_64-unknown-linux-gnu"
# | #define TARGET "x86_64-unknown-linux-gnu"
# | #define CA_BUNDLE "/etc/ssl/certs/ca-certificates.crt"
# | #define CXX11_OVERRIDE override
# | #define HAVE_ZLIB 1
# | #define HAVE_SQLITE3 1
# | #define HAVE_LIBGNUTLS 1
# | #define HAVE_LIBGCRYPT 1
# | #define HAVE_LIBSSH2 1
# | #define HAVE_LIBCARES 1
# | /* end confdefs.h. */
# | #include
# |
# | int
# | main ()
# | {
# | if (sizeof ((ares_addr_node)))
# | return 0;
# | ;
# | return 0;
# | }
# configure:20609: result: yes
# configure:20622: checking for ares_set_servers
# configure:20622: clang++ -o conftest conftest.cpp -lcares >&5
# configure:20622: $? = 0
# configure:20622: result: yes
# configure:21104: checking for size_t
# configure:21104: clang++ -c conftest.cpp >&5
# configure:21104: $? = 0
# configure:21104: clang++ -c conftest.cpp >&5
# conftest.cpp:81:21: error: expected expression
# if (sizeof ((size_t)))
# ^
# 1 error generated.
# configure:21104: $? = 1
# configure: failed program was:
# | /* confdefs.h */
# | #define PACKAGE_NAME "aria2"
# | #define PACKAGE_TARNAME "aria2"
# | #define PACKAGE_VERSION "1.24.0"
# | #define PACKAGE_STRING "aria2 1.24.0"
# | #define PACKAGE_BUGREPORT "https://github.com/aria2/aria2/issues"
# | #define PACKAGE_URL "https://aria2.github.io/"
# | #define PACKAGE "aria2"
# | #define VERSION "1.24.0"
# | #define STDC_HEADERS 1
# | #define HAVE_SYS_TYPES_H 1
# | #define HAVE_SYS_STAT_H 1
# | #define HAVE_STDLIB_H 1
# | #define HAVE_STRING_H 1
# | #define HAVE_MEMORY_H 1
# | #define HAVE_STRINGS_H 1
# | #define HAVE_INTTYPES_H 1
# | #define HAVE_STDINT_H 1
# | #define HAVE_UNISTD_H 1
# | #define __EXTENSIONS__ 1
# | #define _ALL_SOURCE 1
# | #define _GNU_SOURCE 1
# | #define _POSIX_PTHREAD_SEMANTICS 1
# | #define _TANDEM_SOURCE 1
# | #define HAVE_DLFCN_H 1
# | #define LT_OBJDIR ".libs/"
# | #define BUILD "x86_64-pc-linux-gnu"
# | #define HOST "x86_64-unknown-linux-gnu"
# | #define TARGET "x86_64-unknown-linux-gnu"
# | #define CA_BUNDLE "/etc/ssl/certs/ca-certificates.crt"
# | #define CXX11_OVERRIDE override
# | #define HAVE_ZLIB 1
# | #define HAVE_SQLITE3 1
# | #define HAVE_LIBGNUTLS 1
# | #define HAVE_LIBGCRYPT 1
# | #define HAVE_LIBSSH2 1
# | #define HAVE_LIBCARES 1
# | #define HAVE_ARES_ADDR_NODE 1
# | #define HAVE_ARES_SET_SERVERS 1
# | #define USE_LIBGCRYPT_MD 1
# | #define ENABLE_SSL 1
# | #define ENABLE_BITTORRENT 1
# | #define ENABLE_ASYNC_DNS 1
# | /* end confdefs.h. */
# | #include
# | #ifdef HAVE_SYS_TYPES_H
# | # include
# | #endif
# | #ifdef HAVE_SYS_STAT_H
# | # include
# | #endif
# | #ifdef STDC_HEADERS
# | # include
# | # include
# | #else
# | # ifdef HAVE_STDLIB_H
# | # include
# | # endif
# | #endif
# | #ifdef HAVE_STRING_H
# | # if !defined STDC_HEADERS && defined HAVE_MEMORY_H
# | # include
# | # endif
# | # include
# | #endif
# | #ifdef HAVE_STRINGS_H
# | # include
# | #endif
# | #ifdef HAVE_INTTYPES_H
# | # include
# | #endif
# | #ifdef HAVE_STDINT_H
# | # include
# | #endif
# | #ifdef HAVE_UNISTD_H
# | # include
# | #endif
# | int
# | main ()
# | {
# | if (sizeof ((size_t)))
# | return 0;
# | ;
# | return 0;
# | }
# configure:21104: result: yes
# configure:21117: checking for working alloca.h
# configure:21134: clang++ -o conftest conftest.cpp >&5
# configure:21134: $? = 0
# configure:21142: result: yes
# configure:21150: checking for alloca
# configure:21187: clang++ -o conftest conftest.cpp >&5
# configure:21187: $? = 0
# configure:21195: result: yes
# configure:21301: checking for ANSI C header files
# configure:21405: result: yes
# configure:21453: checking argz.h usability
# configure:21453: clang++ -c conftest.cpp >&5
# conftest.cpp:81:10: fatal error: 'argz.h' file not found
# #include
# ^
# 1 error generated.
# configure:21453: $? = 1
# configure: failed program was:
# | /* confdefs.h */
# | #define PACKAGE_NAME "aria2"
# | #define PACKAGE_TARNAME "aria2"
# | #define PACKAGE_VERSION "1.24.0"
# | #define PACKAGE_STRING "aria2 1.24.0"
# | #define PACKAGE_BUGREPORT "https://github.com/aria2/aria2/issues"
# | #define PACKAGE_URL "https://aria2.github.io/"
# | #define PACKAGE "aria2"
# | #define VERSION "1.24.0"
# | #define STDC_HEADERS 1
# | #define HAVE_SYS_TYPES_H 1
# | #define HAVE_SYS_STAT_H 1
# | #define HAVE_STDLIB_H 1
# | #define HAVE_STRING_H 1
# | #define HAVE_MEMORY_H 1
# | #define HAVE_STRINGS_H 1
# | #define HAVE_INTTYPES_H 1
# | #define HAVE_STDINT_H 1
# | #define HAVE_UNISTD_H 1
# | #define __EXTENSIONS__ 1
# | #define _ALL_SOURCE 1
# | #define _GNU_SOURCE 1
# | #define _POSIX_PTHREAD_SEMANTICS 1
# | #define _TANDEM_SOURCE 1
# | #define HAVE_DLFCN_H 1
# | #define LT_OBJDIR ".libs/"
# | #define BUILD "x86_64-pc-linux-gnu"
# | #define HOST "x86_64-unknown-linux-gnu"
# | #define TARGET "x86_64-unknown-linux-gnu"
# | #define CA_BUNDLE "/etc/ssl/certs/ca-certificates.crt"
# | #define CXX11_OVERRIDE override
# | #define HAVE_ZLIB 1
# | #define HAVE_SQLITE3 1
# | #define HAVE_LIBGNUTLS 1
# | #define HAVE_LIBGCRYPT 1
# | #define HAVE_LIBSSH2 1
# | #define HAVE_LIBCARES 1
# | #define HAVE_ARES_ADDR_NODE 1
# | #define HAVE_ARES_SET_SERVERS 1
# | #define USE_LIBGCRYPT_MD 1
# | #define ENABLE_SSL 1
# | #define ENABLE_BITTORRENT 1
# | #define ENABLE_ASYNC_DNS 1
# | #define HAVE_ALLOCA_H 1
# | #define HAVE_ALLOCA 1
# | #define STDC_HEADERS 1
# | /* end confdefs.h. */
# | #include
# | #ifdef HAVE_SYS_TYPES_H
# | # include
# | #endif
# | #ifdef HAVE_SYS_STAT_H
# | # include
# | #endif
# | #ifdef STDC_HEADERS
# | # include
# | # include
# | #else
# | # ifdef HAVE_STDLIB_H
# | # include
# | # endif
# | #endif
# | #ifdef HAVE_STRING_H
# | # if !defined STDC_HEADERS && defined HAVE_MEMORY_H
# | # include
# | # endif
# | # include
# | #endif
# | #ifdef HAVE_STRINGS_H
# | # include
# | #endif
# | #ifdef HAVE_INTTYPES_H
# | # include
# | #endif
# | #ifdef HAVE_STDINT_H
# | # include
# | #endif
# | #ifdef HAVE_UNISTD_H
# | # include
# | #endif
# | #include
# configure:21453: result: no
# configure:21453: checking argz.h presence
# configure:21453: clang++ -E conftest.cpp
# conftest.cpp:48:10: fatal error: 'argz.h' file not found
# #include
# ^
# 1 error generated.
# configure:21453: $? = 1
# configure: failed program was:
# | /* confdefs.h */
# | #define PACKAGE_NAME "aria2"
# | #define PACKAGE_TARNAME "aria2"
# | #define PACKAGE_VERSION "1.24.0"
# | #define PACKAGE_STRING "aria2 1.24.0"
# | #define PACKAGE_BUGREPORT "https://github.com/aria2/aria2/issues"
# | #define PACKAGE_URL "https://aria2.github.io/"
# | #define PACKAGE "aria2"
# | #define VERSION "1.24.0"
# | #define STDC_HEADERS 1
# | #define HAVE_SYS_TYPES_H 1
# | #define HAVE_SYS_STAT_H 1
# | #define HAVE_STDLIB_H 1
# | #define HAVE_STRING_H 1
# | #define HAVE_MEMORY_H 1
# | #define HAVE_STRINGS_H 1
# | #define HAVE_INTTYPES_H 1
# | #define HAVE_STDINT_H 1
# | #define HAVE_UNISTD_H 1
# | #define __EXTENSIONS__ 1
# | #define _ALL_SOURCE 1
# | #define _GNU_SOURCE 1
# | #define _POSIX_PTHREAD_SEMANTICS 1
# | #define _TANDEM_SOURCE 1
# | #define HAVE_DLFCN_H 1
# | #define LT_OBJDIR ".libs/"
# | #define BUILD "x86_64-pc-linux-gnu"
# | #define HOST "x86_64-unknown-linux-gnu"
# | #define TARGET "x86_64-unknown-linux-gnu"
# | #define CA_BUNDLE "/etc/ssl/certs/ca-certificates.crt"
# | #define CXX11_OVERRIDE override
# | #define HAVE_ZLIB 1
# | #define HAVE_SQLITE3 1
# | #define HAVE_LIBGNUTLS 1
# | #define HAVE_LIBGCRYPT 1
# | #define HAVE_LIBSSH2 1
# | #define HAVE_LIBCARES 1
# | #define HAVE_ARES_ADDR_NODE 1
# | #define HAVE_ARES_SET_SERVERS 1
# | #define USE_LIBGCRYPT_MD 1
# | #define ENABLE_SSL 1
# | #define ENABLE_BITTORRENT 1
# | #define ENABLE_ASYNC_DNS 1
# | #define HAVE_ALLOCA_H 1
# | #define HAVE_ALLOCA 1
# | #define STDC_HEADERS 1
# | /* end confdefs.h. */
# | #include
# configure:21453: result: no
# configure:21453: checking for argz.h
# configure:21453: result: no
# configure:21453: checking arpa/inet.h usability
# configure:21453: clang++ -c conftest.cpp >&5
# configure:21453: $? = 0
# configure:21453: result: yes
# configure:21453: checking arpa/inet.h presence
# configure:21453: clang++ -E conftest.cpp
# configure:21453: $? = 0
# configure:21453: result: yes
# configure:21453: checking for arpa/inet.h
# configure:21453: result: yes
# configure:21453: checking fcntl.h usability
# configure:21453: clang++ -c conftest.cpp >&5
# configure:21453: $? = 0
# configure:21453: result: yes
# configure:21453: checking fcntl.h presence
# configure:21453: clang++ -E conftest.cpp
# configure:21453: $? = 0
# configure:21453: result: yes
# configure:21453: checking for fcntl.h
# configure:21453: result: yes
# configure:21453: checking float.h usability
# configure:21453: clang++ -c conftest.cpp >&5
# configure:21453: $? = 0
# configure:21453: result: yes
# configure:21453: checking float.h presence
# configure:21453: clang++ -E conftest.cpp
# configure:21453: $? = 0
# configure:21453: result: yes
# configure:21453: checking for float.h
# configure:21453: result: yes
# configure:21453: checking for inttypes.h
# configure:21453: result: yes
# configure:21453: checking langinfo.h usability
# configure:21453: clang++ -c conftest.cpp >&5
# configure:21453: $? = 0
# configure:21453: result: yes
# configure:21453: checking langinfo.h presence
# configure:21453: clang++ -E conftest.cpp
# configure:21453: $? = 0
# configure:21453: result: yes
# configure:21453: checking for langinfo.h
# configure:21453: result: yes
# configure:21453: checking libintl.h usability
# configure:21453: clang++ -c conftest.cpp >&5
# configure:21453: $? = 0
# configure:21453: result: yes
# configure:21453: checking libintl.h presence
# configure:21453: clang++ -E conftest.cpp
# configure:21453: $? = 0
# configure:21453: result: yes
# configure:21453: checking for libintl.h
# configure:21453: result: yes
# configure:21453: checking limits.h usability
# configure:21453: clang++ -c conftest.cpp >&5
# configure:21453: $? = 0
# configure:21453: result: yes
# configure:21453: checking limits.h presence
# configure:21453: clang++ -E conftest.cpp
# configure:21453: $? = 0
# configure:21453: result: yes
# configure:21453: checking for limits.h
# configure:21453: result: yes
# configure:21453: checking locale.h usability
# configure:21453: clang++ -c conftest.cpp >&5
# configure:21453: $? = 0
# configure:21453: result: yes
# configure:21453: checking locale.h presence
# configure:21453: clang++ -E conftest.cpp
# configure:21453: $? = 0
# configure:21453: result: yes
# configure:21453: checking for locale.h
# configure:21453: result: yes
# configure:21453: checking malloc.h usability
# configure:21453: clang++ -c conftest.cpp >&5
# configure:21453: $? = 0
# configure:21453: result: yes
# configure:21453: checking malloc.h presence
# configure:21453: clang++ -E conftest.cpp
# configure:21453: $? = 0
# configure:21453: result: yes
# configure:21453: checking for malloc.h
# configure:21453: result: yes
# configure:21453: checking netdb.h usability
# configure:21453: clang++ -c conftest.cpp >&5
# configure:21453: $? = 0
# configure:21453: result: yes
# configure:21453: checking netdb.h presence
# configure:21453: clang++ -E conftest.cpp
# configure:21453: $? = 0
# configure:21453: result: yes
# configure:21453: checking for netdb.h
# configure:21453: result: yes
# configure:21453: checking netinet/in.h usability
# configure:21453: clang++ -c conftest.cpp >&5
# configure:21453: $? = 0
# configure:21453: result: yes
# configure:21453: checking netinet/in.h presence
# configure:21453: clang++ -E conftest.cpp
# configure:21453: $? = 0
# configure:21453: result: yes
# configure:21453: checking for netinet/in.h
# configure:21453: result: yes
# configure:21453: checking netinet/tcp.h usability
# configure:21453: clang++ -c conftest.cpp >&5
# configure:21453: $? = 0
# configure:21453: result: yes
# configure:21453: checking netinet/tcp.h presence
# configure:21453: clang++ -E conftest.cpp
# configure:21453: $? = 0
# configure:21453: result: yes
# configure:21453: checking for netinet/tcp.h
# configure:21453: result: yes
# configure:21453: checking poll.h usability
# configure:21453: clang++ -c conftest.cpp >&5
# configure:21453: $? = 0
# configure:21453: result: yes
# configure:21453: checking poll.h presence
# configure:21453: clang++ -E conftest.cpp
# configure:21453: $? = 0
# configure:21453: result: yes
# configure:21453: checking for poll.h
# configure:21453: result: yes
# configure:21453: checking port.h usability
# configure:21453: clang++ -c conftest.cpp >&5
# conftest.cpp:94:10: fatal error: 'port.h' file not found
# #include
# ^
# 1 error generated.
# configure:21453: $? = 1
# configure: failed program was:
# | /* confdefs.h */
# | #define PACKAGE_NAME "aria2"
# | #define PACKAGE_TARNAME "aria2"
# | #define PACKAGE_VERSION "1.24.0"
# | #define PACKAGE_STRING "aria2 1.24.0"
# | #define PACKAGE_BUGREPORT "https://github.com/aria2/aria2/issues"
# | #define PACKAGE_URL "https://aria2.github.io/"
# | #define PACKAGE "aria2"
# | #define VERSION "1.24.0"
# | #define STDC_HEADERS 1
# | #define HAVE_SYS_TYPES_H 1
# | #define HAVE_SYS_STAT_H 1
# | #define HAVE_STDLIB_H 1
# | #define HAVE_STRING_H 1
# | #define HAVE_MEMORY_H 1
# | #define HAVE_STRINGS_H 1
# | #define HAVE_INTTYPES_H 1
# | #define HAVE_STDINT_H 1
# | #define HAVE_UNISTD_H 1
# | #define __EXTENSIONS__ 1
# | #define _ALL_SOURCE 1
# | #define _GNU_SOURCE 1
# | #define _POSIX_PTHREAD_SEMANTICS 1
# | #define _TANDEM_SOURCE 1
# | #define HAVE_DLFCN_H 1
# | #define LT_OBJDIR ".libs/"
# | #define BUILD "x86_64-pc-linux-gnu"
# | #define HOST "x86_64-unknown-linux-gnu"
# | #define TARGET "x86_64-unknown-linux-gnu"
# | #define CA_BUNDLE "/etc/ssl/certs/ca-certificates.crt"
# | #define CXX11_OVERRIDE override
# | #define HAVE_ZLIB 1
# | #define HAVE_SQLITE3 1
# | #define HAVE_LIBGNUTLS 1
# | #define HAVE_LIBGCRYPT 1
# | #define HAVE_LIBSSH2 1
# | #define HAVE_LIBCARES 1
# | #define HAVE_ARES_ADDR_NODE 1
# | #define HAVE_ARES_SET_SERVERS 1
# | #define USE_LIBGCRYPT_MD 1
# | #define ENABLE_SSL 1
# | #define ENABLE_BITTORRENT 1
# | #define ENABLE_ASYNC_DNS 1
# | #define HAVE_ALLOCA_H 1
# | #define HAVE_ALLOCA 1
# | #define STDC_HEADERS 1
# | #define HAVE_ARPA_INET_H 1
# | #define HAVE_FCNTL_H 1
# | #define HAVE_FLOAT_H 1
# | #define HAVE_INTTYPES_H 1
# | #define HAVE_LANGINFO_H 1
# | #define HAVE_LIBINTL_H 1
# | #define HAVE_LIMITS_H 1
# | #define HAVE_LOCALE_H 1
# | #define HAVE_MALLOC_H 1
# | #define HAVE_NETDB_H 1
# | #define HAVE_NETINET_IN_H 1
# | #define HAVE_NETINET_TCP_H 1
# | #define HAVE_POLL_H 1
# | /* end confdefs.h. */
# | #include
# | #ifdef HAVE_SYS_TYPES_H
# | # include
# | #endif
# | #ifdef HAVE_SYS_STAT_H
# | # include
# | #endif
# | #ifdef STDC_HEADERS
# | # include
# | # include
# | #else
# | # ifdef HAVE_STDLIB_H
# | # include
# | # endif
# | #endif
# | #ifdef HAVE_STRING_H
# | # if !defined STDC_HEADERS && defined HAVE_MEMORY_H
# | # include
# | # endif
# | # include
# | #endif
# | #ifdef HAVE_STRINGS_H
# | # include
# | #endif
# | #ifdef HAVE_INTTYPES_H
# | # include
# | #endif
# | #ifdef HAVE_STDINT_H
# | # include
# | #endif
# | #ifdef HAVE_UNISTD_H
# | # include
# | #endif
# | #include
# configure:21453: result: no
# configure:21453: checking port.h presence
# configure:21453: clang++ -E conftest.cpp
# conftest.cpp:61:10: fatal error: 'port.h' file not found
# #include
# ^
# 1 error generated.
# configure:21453: $? = 1
# configure: failed program was:
# | /* confdefs.h */
# | #define PACKAGE_NAME "aria2"
# | #define PACKAGE_TARNAME "aria2"
# | #define PACKAGE_VERSION "1.24.0"
# | #define PACKAGE_STRING "aria2 1.24.0"
# | #define PACKAGE_BUGREPORT "https://github.com/aria2/aria2/issues"
# | #define PACKAGE_URL "https://aria2.github.io/"
# | #define PACKAGE "aria2"
# | #define VERSION "1.24.0"
# | #define STDC_HEADERS 1
# | #define HAVE_SYS_TYPES_H 1
# | #define HAVE_SYS_STAT_H 1
# | #define HAVE_STDLIB_H 1
# | #define HAVE_STRING_H 1
# | #define HAVE_MEMORY_H 1
# | #define HAVE_STRINGS_H 1
# | #define HAVE_INTTYPES_H 1
# | #define HAVE_STDINT_H 1
# | #define HAVE_UNISTD_H 1
# | #define __EXTENSIONS__ 1
# | #define _ALL_SOURCE 1
# | #define _GNU_SOURCE 1
# | #define _POSIX_PTHREAD_SEMANTICS 1
# | #define _TANDEM_SOURCE 1
# | #define HAVE_DLFCN_H 1
# | #define LT_OBJDIR ".libs/"
# | #define BUILD "x86_64-pc-linux-gnu"
# | #define HOST "x86_64-unknown-linux-gnu"
# | #define TARGET "x86_64-unknown-linux-gnu"
# | #define CA_BUNDLE "/etc/ssl/certs/ca-certificates.crt"
# | #define CXX11_OVERRIDE override
# | #define HAVE_ZLIB 1
# | #define HAVE_SQLITE3 1
# | #define HAVE_LIBGNUTLS 1
# | #define HAVE_LIBGCRYPT 1
# | #define HAVE_LIBSSH2 1
# | #define HAVE_LIBCARES 1
# | #define HAVE_ARES_ADDR_NODE 1
# | #define HAVE_ARES_SET_SERVERS 1
# | #define USE_LIBGCRYPT_MD 1
# | #define ENABLE_SSL 1
# | #define ENABLE_BITTORRENT 1
# | #define ENABLE_ASYNC_DNS 1
# | #define HAVE_ALLOCA_H 1
# | #define HAVE_ALLOCA 1
# | #define STDC_HEADERS 1
# | #define HAVE_ARPA_INET_H 1
# | #define HAVE_FCNTL_H 1
# | #define HAVE_FLOAT_H 1
# | #define HAVE_INTTYPES_H 1
# | #define HAVE_LANGINFO_H 1
# | #define HAVE_LIBINTL_H 1
# | #define HAVE_LIMITS_H 1
# | #define HAVE_LOCALE_H 1
# | #define HAVE_MALLOC_H 1
# | #define HAVE_NETDB_H 1
# | #define HAVE_NETINET_IN_H 1
# | #define HAVE_NETINET_TCP_H 1
# | #define HAVE_POLL_H 1
# | /* end confdefs.h. */
# | #include
# configure:21453: result: no
# configure:21453: checking for port.h
# configure:21453: result: no
# configure:21453: checking signal.h usability
# configure:21453: clang++ -c conftest.cpp >&5
# configure:21453: $? = 0
# configure:21453: result: yes
# configure:21453: checking signal.h presence
# configure:21453: clang++ -E conftest.cpp
# configure:21453: $? = 0
# configure:21453: result: yes
# configure:21453: checking for signal.h
# configure:21453: result: yes
# configure:21453: checking stddef.h usability
# configure:21453: clang++ -c conftest.cpp >&5
# configure:21453: $? = 0
# configure:21453: result: yes
# configure:21453: checking stddef.h presence
# configure:21453: clang++ -E conftest.cpp
# configure:21453: $? = 0
# configure:21453: result: yes
# configure:21453: checking for stddef.h
# configure:21453: result: yes
# configure:21453: checking for stdint.h
# configure:21453: result: yes
# configure:21453: checking stdio_ext.h usability
# configure:21453: clang++ -c conftest.cpp >&5
# configure:21453: $? = 0
# configure:21453: result: yes
# configure:21453: checking stdio_ext.h presence
# configure:21453: clang++ -E conftest.cpp
# configure:21453: $? = 0
# configure:21453: result: yes
# configure:21453: checking for stdio_ext.h
# configure:21453: result: yes
# configure:21453: checking for stdlib.h
# configure:21453: result: yes
# configure:21453: checking for string.h
# configure:21453: result: yes
# configure:21453: checking for strings.h
# configure:21453: result: yes
# configure:21453: checking sys/ioctl.h usability
# configure:21453: clang++ -c conftest.cpp >&5
# configure:21453: $? = 0
# configure:21453: result: yes
# configure:21453: checking sys/ioctl.h presence
# configure:21453: clang++ -E conftest.cpp
# configure:21453: $? = 0
# configure:21453: result: yes
# configure:21453: checking for sys/ioctl.h
# configure:21453: result: yes
# configure:21453: checking sys/param.h usability
# configure:21453: clang++ -c conftest.cpp >&5
# configure:21453: $? = 0
# configure:21453: result: yes
# configure:21453: checking sys/param.h presence
# configure:21453: clang++ -E conftest.cpp
# configure:21453: $? = 0
# configure:21453: result: yes
# configure:21453: checking for sys/param.h
# configure:21453: result: yes
# configure:21453: checking sys/resource.h usability
# configure:21453: clang++ -c conftest.cpp >&5
# configure:21453: $? = 0
# configure:21453: result: yes
# configure:21453: checking sys/resource.h presence
# configure:21453: clang++ -E conftest.cpp
# configure:21453: $? = 0
# configure:21453: result: yes
# configure:21453: checking for sys/resource.h
# configure:21453: result: yes
# configure:21453: checking sys/signal.h usability
# configure:21453: clang++ -c conftest.cpp >&5
# In file included from conftest.cpp:104:
# /sysroot/include/sys/signal.h:1:2: warning: redirecting incorrect #include to [-W#warnings]
# #warning redirecting incorrect #include to
# ^
# 1 warning generated.
# configure:21453: $? = 0
# configure:21453: result: yes
# configure:21453: checking sys/signal.h presence
# configure:21453: clang++ -E conftest.cpp
# In file included from conftest.cpp:71:
# /sysroot/include/sys/signal.h:1:2: warning: redirecting incorrect #include to [-W#warnings]
# #warning redirecting incorrect #include to
# ^
# 1 warning generated.
# configure:21453: $? = 0
# configure:21453: result: yes
# configure:21453: checking for sys/signal.h
# configure:21453: result: yes
# configure:21453: checking sys/socket.h usability
# configure:21453: clang++ -c conftest.cpp >&5
# configure:21453: $? = 0
# configure:21453: result: yes
# configure:21453: checking sys/socket.h presence
# configure:21453: clang++ -E conftest.cpp
# configure:21453: $? = 0
# configure:21453: result: yes
# configure:21453: checking for sys/socket.h
# configure:21453: result: yes
# configure:21453: checking sys/time.h usability
# configure:21453: clang++ -c conftest.cpp >&5
# configure:21453: $? = 0
# configure:21453: result: yes
# configure:21453: checking sys/time.h presence
# configure:21453: clang++ -E conftest.cpp
# configure:21453: $? = 0
# configure:21453: result: yes
# configure:21453: checking for sys/time.h
# configure:21453: result: yes
# configure:21453: checking for sys/types.h
# configure:21453: result: yes
# configure:21453: checking sys/uio.h usability
# configure:21453: clang++ -c conftest.cpp >&5
# configure:21453: $? = 0
# configure:21453: result: yes
# configure:21453: checking sys/uio.h presence
# configure:21453: clang++ -E conftest.cpp
# configure:21453: $? = 0
# configure:21453: result: yes
# configure:21453: checking for sys/uio.h
# configure:21453: result: yes
# configure:21453: checking sys/utsname.h usability
# configure:21453: clang++ -c conftest.cpp >&5
# configure:21453: $? = 0
# configure:21453: result: yes
# configure:21453: checking sys/utsname.h presence
# configure:21453: clang++ -E conftest.cpp
# configure:21453: $? = 0
# configure:21453: result: yes
# configure:21453: checking for sys/utsname.h
# configure:21453: result: yes
# configure:21453: checking termios.h usability
# configure:21453: clang++ -c conftest.cpp >&5
# configure:21453: $? = 0
# configure:21453: result: yes
# configure:21453: checking termios.h presence
# configure:21453: clang++ -E conftest.cpp
# configure:21453: $? = 0
# configure:21453: result: yes
# configure:21453: checking for termios.h
# configure:21453: result: yes
# configure:21453: checking for unistd.h
# configure:21453: result: yes
# configure:21453: checking utime.h usability
# configure:21453: clang++ -c conftest.cpp >&5
# configure:21453: $? = 0
# configure:21453: result: yes
# configure:21453: checking utime.h presence
# configure:21453: clang++ -E conftest.cpp
# configure:21453: $? = 0
# configure:21453: result: yes
# configure:21453: checking for utime.h
# configure:21453: result: yes
# configure:21453: checking wchar.h usability
# configure:21453: clang++ -c conftest.cpp >&5
# configure:21453: $? = 0
# configure:21453: result: yes
# configure:21453: checking wchar.h presence
# configure:21453: clang++ -E conftest.cpp
# configure:21453: $? = 0
# configure:21453: result: yes
# configure:21453: checking for wchar.h
# configure:21453: result: yes
# configure:21453: checking ifaddrs.h usability
# configure:21453: clang++ -c conftest.cpp >&5
# configure:21453: $? = 0
# configure:21453: result: yes
# configure:21453: checking ifaddrs.h presence
# configure:21453: clang++ -E conftest.cpp
# configure:21453: $? = 0
# configure:21453: result: yes
# configure:21453: checking for ifaddrs.h
# configure:21453: result: yes
# configure:21453: checking pwd.h usability
# configure:21453: clang++ -c conftest.cpp >&5
# configure:21453: $? = 0
# configure:21453: result: yes
# configure:21453: checking pwd.h presence
# configure:21453: clang++ -E conftest.cpp
# configure:21453: $? = 0
# configure:21453: result: yes
# configure:21453: checking for pwd.h
# configure:21453: result: yes
# configure:21465: checking for stdbool.h that conforms to C99
# configure:21532: clang++ -c conftest.cpp >&5
# conftest.cpp:132:24: warning: address of 's' will always evaluate to 'true' [-Wpointer-bool-conversion]
# bool e = &s;
# ~ ^
# conftest.cpp:136:23: warning: address of array 'a' will always evaluate to 'true' [-Wpointer-bool-conversion]
# return (!a + !b + !c + !d + !e + !f + !g + !h + !i + !!j + !k + !!l
# ~^
# conftest.cpp:136:28: warning: address of array 'b' will always evaluate to 'true' [-Wpointer-bool-conversion]
# return (!a + !b + !c + !d + !e + !f + !g + !h + !i + !!j + !k + !!l
# ~^
# conftest.cpp:136:33: warning: address of array 'c' will always evaluate to 'true' [-Wpointer-bool-conversion]
# return (!a + !b + !c + !d + !e + !f + !g + !h + !i + !!j + !k + !!l
# ~^
# conftest.cpp:136:38: warning: address of array 'd' will always evaluate to 'true' [-Wpointer-bool-conversion]
# return (!a + !b + !c + !d + !e + !f + !g + !h + !i + !!j + !k + !!l
# ~^
# conftest.cpp:136:48: warning: address of array 'f' will always evaluate to 'true' [-Wpointer-bool-conversion]
# return (!a + !b + !c + !d + !e + !f + !g + !h + !i + !!j + !k + !!l
# ~^
# conftest.cpp:136:53: warning: address of array 'g' will always evaluate to 'true' [-Wpointer-bool-conversion]
# return (!a + !b + !c + !d + !e + !f + !g + !h + !i + !!j + !k + !!l
# ~^
# conftest.cpp:136:58: warning: address of array 'h' will always evaluate to 'true' [-Wpointer-bool-conversion]
# return (!a + !b + !c + !d + !e + !f + !g + !h + !i + !!j + !k + !!l
# ~^
# conftest.cpp:136:63: warning: address of array 'i' will always evaluate to 'true' [-Wpointer-bool-conversion]
# return (!a + !b + !c + !d + !e + !f + !g + !h + !i + !!j + !k + !!l
# ~^
# conftest.cpp:137:30: warning: address of array 'n' will always evaluate to 'true' [-Wpointer-bool-conversion]
# ~^
# conftest.cpp:137:35: warning: address of array 'o' will always evaluate to 'true' [-Wpointer-bool-conversion]
# ~^
# conftest.cpp:137:40: warning: address of array 'p' will always evaluate to 'true' [-Wpointer-bool-conversion]
# ~^
# 12 warnings generated.
# configure:21532: $? = 0
# configure:21539: result: yes
# configure:21541: checking for _Bool
# configure:21541: clang++ -c conftest.cpp >&5
# conftest.cpp:119:13: error: use of undeclared identifier '_Bool'
# if (sizeof (_Bool))
# ^
# 1 error generated.
# configure:21541: $? = 1
# configure: failed program was:
# | /* confdefs.h */
# | #define PACKAGE_NAME "aria2"
# | #define PACKAGE_TARNAME "aria2"
# | #define PACKAGE_VERSION "1.24.0"
# | #define PACKAGE_STRING "aria2 1.24.0"
# | #define PACKAGE_BUGREPORT "https://github.com/aria2/aria2/issues"
# | #define PACKAGE_URL "https://aria2.github.io/"
# | #define PACKAGE "aria2"
# | #define VERSION "1.24.0"
# | #define STDC_HEADERS 1
# | #define HAVE_SYS_TYPES_H 1
# | #define HAVE_SYS_STAT_H 1
# | #define HAVE_STDLIB_H 1
# | #define HAVE_STRING_H 1
# | #define HAVE_MEMORY_H 1
# | #define HAVE_STRINGS_H 1
# | #define HAVE_INTTYPES_H 1
# | #define HAVE_STDINT_H 1
# | #define HAVE_UNISTD_H 1
# | #define __EXTENSIONS__ 1
# | #define _ALL_SOURCE 1
# | #define _GNU_SOURCE 1
# | #define _POSIX_PTHREAD_SEMANTICS 1
# | #define _TANDEM_SOURCE 1
# | #define HAVE_DLFCN_H 1
# | #define LT_OBJDIR ".libs/"
# | #define BUILD "x86_64-pc-linux-gnu"
# | #define HOST "x86_64-unknown-linux-gnu"
# | #define TARGET "x86_64-unknown-linux-gnu"
# | #define CA_BUNDLE "/etc/ssl/certs/ca-certificates.crt"
# | #define CXX11_OVERRIDE override
# | #define HAVE_ZLIB 1
# | #define HAVE_SQLITE3 1
# | #define HAVE_LIBGNUTLS 1
# | #define HAVE_LIBGCRYPT 1
# | #define HAVE_LIBSSH2 1
# | #define HAVE_LIBCARES 1
# | #define HAVE_ARES_ADDR_NODE 1
# | #define HAVE_ARES_SET_SERVERS 1
# | #define USE_LIBGCRYPT_MD 1
# | #define ENABLE_SSL 1
# | #define ENABLE_BITTORRENT 1
# | #define ENABLE_ASYNC_DNS 1
# | #define HAVE_ALLOCA_H 1
# | #define HAVE_ALLOCA 1
# | #define STDC_HEADERS 1
# | #define HAVE_ARPA_INET_H 1
# | #define HAVE_FCNTL_H 1
# | #define HAVE_FLOAT_H 1
# | #define HAVE_INTTYPES_H 1
# | #define HAVE_LANGINFO_H 1
# | #define HAVE_LIBINTL_H 1
# | #define HAVE_LIMITS_H 1
# | #define HAVE_LOCALE_H 1
# | #define HAVE_MALLOC_H 1
# | #define HAVE_NETDB_H 1
# | #define HAVE_NETINET_IN_H 1
# | #define HAVE_NETINET_TCP_H 1
# | #define HAVE_POLL_H 1
# | #define HAVE_SIGNAL_H 1
# | #define HAVE_STDDEF_H 1
# | #define HAVE_STDINT_H 1
# | #define HAVE_STDIO_EXT_H 1
# | #define HAVE_STDLIB_H 1
# | #define HAVE_STRING_H 1
# | #define HAVE_STRINGS_H 1
# | #define HAVE_SYS_IOCTL_H 1
# | #define HAVE_SYS_PARAM_H 1
# | #define HAVE_SYS_RESOURCE_H 1
# | #define HAVE_SYS_SIGNAL_H 1
# | #define HAVE_SYS_SOCKET_H 1
# | #define HAVE_SYS_TIME_H 1
# | #define HAVE_SYS_TYPES_H 1
# | #define HAVE_SYS_UIO_H 1
# | #define HAVE_SYS_UTSNAME_H 1
# | #define HAVE_TERMIOS_H 1
# | #define HAVE_UNISTD_H 1
# | #define HAVE_UTIME_H 1
# | #define HAVE_WCHAR_H 1
# | #define HAVE_IFADDRS_H 1
# | #define HAVE_PWD_H 1
# | /* end confdefs.h. */
# | #include
# | #ifdef HAVE_SYS_TYPES_H
# | # include
# | #endif
# | #ifdef HAVE_SYS_STAT_H
# | # include
# | #endif
# | #ifdef STDC_HEADERS
# | # include
# | # include
# | #else
# | # ifdef HAVE_STDLIB_H
# | # include
# | # endif
# | #endif
# | #ifdef HAVE_STRING_H
# | # if !defined STDC_HEADERS && defined HAVE_MEMORY_H
# | # include
# | # endif
# | # include
# | #endif
# | #ifdef HAVE_STRINGS_H
# | # include
# | #endif
# | #ifdef HAVE_INTTYPES_H
# | # include
# | #endif
# | #ifdef HAVE_STDINT_H
# | # include
# | #endif
# | #ifdef HAVE_UNISTD_H
# | # include
# | #endif
# | int
# | main ()
# | {
# | if (sizeof (_Bool))
# | return 0;
# | ;
# | return 0;
# | }
# configure:21541: result: no
# configure:21558: checking for an ANSI C-conforming const
# configure:21624: clang++ -c conftest.cpp >&5
# configure:21624: $? = 0
# configure:21631: result: yes
# configure:21639: checking for inline
# configure:21655: clang++ -c conftest.cpp >&5
# configure:21655: $? = 0
# configure:21663: result: inline
# configure:21681: checking for int16_t
# configure:21681: clang++ -c conftest.cpp >&5
# configure:21681: $? = 0
# configure:21681: clang++ -c conftest.cpp >&5
# conftest.cpp:121:24: error: 'test_array' declared as an array with a negative size
# static int test_array [1 - 2 * !((int16_t) (((((int16_t) 1 << N) << N) - 1) * 2 + 1)
# ^~~~~~~~~~~~~~~~~~~~~~~~~~~~~~~~~~~~~~~~~~~~~~~~~~~~~~~~~~~~~
# 1 error generated.
# configure:21681: $? = 1
# configure: failed program was:
# | /* confdefs.h */
# | #define PACKAGE_NAME "aria2"
# | #define PACKAGE_TARNAME "aria2"
# | #define PACKAGE_VERSION "1.24.0"
# | #define PACKAGE_STRING "aria2 1.24.0"
# | #define PACKAGE_BUGREPORT "https://github.com/aria2/aria2/issues"
# | #define PACKAGE_URL "https://aria2.github.io/"
# | #define PACKAGE "aria2"
# | #define VERSION "1.24.0"
# | #define STDC_HEADERS 1
# | #define HAVE_SYS_TYPES_H 1
# | #define HAVE_SYS_STAT_H 1
# | #define HAVE_STDLIB_H 1
# | #define HAVE_STRING_H 1
# | #define HAVE_MEMORY_H 1
# | #define HAVE_STRINGS_H 1
# | #define HAVE_INTTYPES_H 1
# | #define HAVE_STDINT_H 1
# | #define HAVE_UNISTD_H 1
# | #define __EXTENSIONS__ 1
# | #define _ALL_SOURCE 1
# | #define _GNU_SOURCE 1
# | #define _POSIX_PTHREAD_SEMANTICS 1
# | #define _TANDEM_SOURCE 1
# | #define HAVE_DLFCN_H 1
# | #define LT_OBJDIR ".libs/"
# | #define BUILD "x86_64-pc-linux-gnu"
# | #define HOST "x86_64-unknown-linux-gnu"
# | #define TARGET "x86_64-unknown-linux-gnu"
# | #define CA_BUNDLE "/etc/ssl/certs/ca-certificates.crt"
# | #define CXX11_OVERRIDE override
# | #define HAVE_ZLIB 1
# | #define HAVE_SQLITE3 1
# | #define HAVE_LIBGNUTLS 1
# | #define HAVE_LIBGCRYPT 1
# | #define HAVE_LIBSSH2 1
# | #define HAVE_LIBCARES 1
# | #define HAVE_ARES_ADDR_NODE 1
# | #define HAVE_ARES_SET_SERVERS 1
# | #define USE_LIBGCRYPT_MD 1
# | #define ENABLE_SSL 1
# | #define ENABLE_BITTORRENT 1
# | #define ENABLE_ASYNC_DNS 1
# | #define HAVE_ALLOCA_H 1
# | #define HAVE_ALLOCA 1
# | #define STDC_HEADERS 1
# | #define HAVE_ARPA_INET_H 1
# | #define HAVE_FCNTL_H 1
# | #define HAVE_FLOAT_H 1
# | #define HAVE_INTTYPES_H 1
# | #define HAVE_LANGINFO_H 1
# | #define HAVE_LIBINTL_H 1
# | #define HAVE_LIMITS_H 1
# | #define HAVE_LOCALE_H 1
# | #define HAVE_MALLOC_H 1
# | #define HAVE_NETDB_H 1
# | #define HAVE_NETINET_IN_H 1
# | #define HAVE_NETINET_TCP_H 1
# | #define HAVE_POLL_H 1
# | #define HAVE_SIGNAL_H 1
# | #define HAVE_STDDEF_H 1
# | #define HAVE_STDINT_H 1
# | #define HAVE_STDIO_EXT_H 1
# | #define HAVE_STDLIB_H 1
# | #define HAVE_STRING_H 1
# | #define HAVE_STRINGS_H 1
# | #define HAVE_SYS_IOCTL_H 1
# | #define HAVE_SYS_PARAM_H 1
# | #define HAVE_SYS_RESOURCE_H 1
# | #define HAVE_SYS_SIGNAL_H 1
# | #define HAVE_SYS_SOCKET_H 1
# | #define HAVE_SYS_TIME_H 1
# | #define HAVE_SYS_TYPES_H 1
# | #define HAVE_SYS_UIO_H 1
# | #define HAVE_SYS_UTSNAME_H 1
# | #define HAVE_TERMIOS_H 1
# | #define HAVE_UNISTD_H 1
# | #define HAVE_UTIME_H 1
# | #define HAVE_WCHAR_H 1
# | #define HAVE_IFADDRS_H 1
# | #define HAVE_PWD_H 1
# | #define HAVE_STDBOOL_H 1
# | /* end confdefs.h. */
# | #include
# | #ifdef HAVE_SYS_TYPES_H
# | # include
# | #endif
# | #ifdef HAVE_SYS_STAT_H
# | # include
# | #endif
# | #ifdef STDC_HEADERS
# | # include
# | # include
# | #else
# | # ifdef HAVE_STDLIB_H
# | # include
# | # endif
# | #endif
# | #ifdef HAVE_STRING_H
# | # if !defined STDC_HEADERS && defined HAVE_MEMORY_H
# | # include
# | # endif
# | # include
# | #endif
# | #ifdef HAVE_STRINGS_H
# | # include
# | #endif
# | #ifdef HAVE_INTTYPES_H
# | # include
# | #endif
# | #ifdef HAVE_STDINT_H
# | # include
# | #endif
# | #ifdef HAVE_UNISTD_H
# | # include
# | #endif
# | enum { N = 16 / 2 - 1 };
# | int
# | main ()
# | {
# | static int test_array [1 - 2 * !((int16_t) (((((int16_t) 1 << N) << N) - 1) * 2 + 1)
# | < (int16_t) (((((int16_t) 1 << N) << N) - 1) * 2 + 2))];
# | test_array [0] = 0;
# | return test_array [0];
# |
# | ;
# | return 0;
# | }
# configure:21681: result: yes
# configure:21692: checking for int32_t
# configure:21692: clang++ -c conftest.cpp >&5
# configure:21692: $? = 0
# configure:21692: clang++ -c conftest.cpp >&5
# conftest.cpp:121:24: error: 'test_array' declared as an array with a negative size
# static int test_array [1 - 2 * !((int32_t) (((((int32_t) 1 << N) << N) - 1) * 2 + 1)
# ^~~~~~~~~~~~~~~~~~~~~~~~~~~~~~~~~~~~~~~~~~~~~~~~~~~~~~~~~~~~~
# 1 error generated.
# configure:21692: $? = 1
# configure: failed program was:
# | /* confdefs.h */
# | #define PACKAGE_NAME "aria2"
# | #define PACKAGE_TARNAME "aria2"
# | #define PACKAGE_VERSION "1.24.0"
# | #define PACKAGE_STRING "aria2 1.24.0"
# | #define PACKAGE_BUGREPORT "https://github.com/aria2/aria2/issues"
# | #define PACKAGE_URL "https://aria2.github.io/"
# | #define PACKAGE "aria2"
# | #define VERSION "1.24.0"
# | #define STDC_HEADERS 1
# | #define HAVE_SYS_TYPES_H 1
# | #define HAVE_SYS_STAT_H 1
# | #define HAVE_STDLIB_H 1
# | #define HAVE_STRING_H 1
# | #define HAVE_MEMORY_H 1
# | #define HAVE_STRINGS_H 1
# | #define HAVE_INTTYPES_H 1
# | #define HAVE_STDINT_H 1
# | #define HAVE_UNISTD_H 1
# | #define __EXTENSIONS__ 1
# | #define _ALL_SOURCE 1
# | #define _GNU_SOURCE 1
# | #define _POSIX_PTHREAD_SEMANTICS 1
# | #define _TANDEM_SOURCE 1
# | #define HAVE_DLFCN_H 1
# | #define LT_OBJDIR ".libs/"
# | #define BUILD "x86_64-pc-linux-gnu"
# | #define HOST "x86_64-unknown-linux-gnu"
# | #define TARGET "x86_64-unknown-linux-gnu"
# | #define CA_BUNDLE "/etc/ssl/certs/ca-certificates.crt"
# | #define CXX11_OVERRIDE override
# | #define HAVE_ZLIB 1
# | #define HAVE_SQLITE3 1
# | #define HAVE_LIBGNUTLS 1
# | #define HAVE_LIBGCRYPT 1
# | #define HAVE_LIBSSH2 1
# | #define HAVE_LIBCARES 1
# | #define HAVE_ARES_ADDR_NODE 1
# | #define HAVE_ARES_SET_SERVERS 1
# | #define USE_LIBGCRYPT_MD 1
# | #define ENABLE_SSL 1
# | #define ENABLE_BITTORRENT 1
# | #define ENABLE_ASYNC_DNS 1
# | #define HAVE_ALLOCA_H 1
# | #define HAVE_ALLOCA 1
# | #define STDC_HEADERS 1
# | #define HAVE_ARPA_INET_H 1
# | #define HAVE_FCNTL_H 1
# | #define HAVE_FLOAT_H 1
# | #define HAVE_INTTYPES_H 1
# | #define HAVE_LANGINFO_H 1
# | #define HAVE_LIBINTL_H 1
# | #define HAVE_LIMITS_H 1
# | #define HAVE_LOCALE_H 1
# | #define HAVE_MALLOC_H 1
# | #define HAVE_NETDB_H 1
# | #define HAVE_NETINET_IN_H 1
# | #define HAVE_NETINET_TCP_H 1
# | #define HAVE_POLL_H 1
# | #define HAVE_SIGNAL_H 1
# | #define HAVE_STDDEF_H 1
# | #define HAVE_STDINT_H 1
# | #define HAVE_STDIO_EXT_H 1
# | #define HAVE_STDLIB_H 1
# | #define HAVE_STRING_H 1
# | #define HAVE_STRINGS_H 1
# | #define HAVE_SYS_IOCTL_H 1
# | #define HAVE_SYS_PARAM_H 1
# | #define HAVE_SYS_RESOURCE_H 1
# | #define HAVE_SYS_SIGNAL_H 1
# | #define HAVE_SYS_SOCKET_H 1
# | #define HAVE_SYS_TIME_H 1
# | #define HAVE_SYS_TYPES_H 1
# | #define HAVE_SYS_UIO_H 1
# | #define HAVE_SYS_UTSNAME_H 1
# | #define HAVE_TERMIOS_H 1
# | #define HAVE_UNISTD_H 1
# | #define HAVE_UTIME_H 1
# | #define HAVE_WCHAR_H 1
# | #define HAVE_IFADDRS_H 1
# | #define HAVE_PWD_H 1
# | #define HAVE_STDBOOL_H 1
# | /* end confdefs.h. */
# | #include
# | #ifdef HAVE_SYS_TYPES_H
# | # include
# | #endif
# | #ifdef HAVE_SYS_STAT_H
# | # include
# | #endif
# | #ifdef STDC_HEADERS
# | # include
# | # include
# | #else
# | # ifdef HAVE_STDLIB_H
# | # include
# | # endif
# | #endif
# | #ifdef HAVE_STRING_H
# | # if !defined STDC_HEADERS && defined HAVE_MEMORY_H
# | # include
# | # endif
# | # include
# | #endif
# | #ifdef HAVE_STRINGS_H
# | # include
# | #endif
# | #ifdef HAVE_INTTYPES_H
# | # include
# | #endif
# | #ifdef HAVE_STDINT_H
# | # include
# | #endif
# | #ifdef HAVE_UNISTD_H
# | # include
# | #endif
# | enum { N = 32 / 2 - 1 };
# | int
# | main ()
# | {
# | static int test_array [1 - 2 * !((int32_t) (((((int32_t) 1 << N) << N) - 1) * 2 + 1)
# | < (int32_t) (((((int32_t) 1 << N) << N) - 1) * 2 + 2))];
# | test_array [0] = 0;
# | return test_array [0];
# |
# | ;
# | return 0;
# | }
# configure:21692: result: yes
# configure:21703: checking for int64_t
# configure:21703: clang++ -c conftest.cpp >&5
# configure:21703: $? = 0
# configure:21703: clang++ -c conftest.cpp >&5
# conftest.cpp:121:24: error: 'test_array' declared as an array with a negative size
# static int test_array [1 - 2 * !((int64_t) (((((int64_t) 1 << N) << N) - 1) * 2 + 1)
# ^~~~~~~~~~~~~~~~~~~~~~~~~~~~~~~~~~~~~~~~~~~~~~~~~~~~~~~~~~~~~
# 1 error generated.
# configure:21703: $? = 1
# configure: failed program was:
# | /* confdefs.h */
# | #define PACKAGE_NAME "aria2"
# | #define PACKAGE_TARNAME "aria2"
# | #define PACKAGE_VERSION "1.24.0"
# | #define PACKAGE_STRING "aria2 1.24.0"
# | #define PACKAGE_BUGREPORT "https://github.com/aria2/aria2/issues"
# | #define PACKAGE_URL "https://aria2.github.io/"
# | #define PACKAGE "aria2"
# | #define VERSION "1.24.0"
# | #define STDC_HEADERS 1
# | #define HAVE_SYS_TYPES_H 1
# | #define HAVE_SYS_STAT_H 1
# | #define HAVE_STDLIB_H 1
# | #define HAVE_STRING_H 1
# | #define HAVE_MEMORY_H 1
# | #define HAVE_STRINGS_H 1
# | #define HAVE_INTTYPES_H 1
# | #define HAVE_STDINT_H 1
# | #define HAVE_UNISTD_H 1
# | #define __EXTENSIONS__ 1
# | #define _ALL_SOURCE 1
# | #define _GNU_SOURCE 1
# | #define _POSIX_PTHREAD_SEMANTICS 1
# | #define _TANDEM_SOURCE 1
# | #define HAVE_DLFCN_H 1
# | #define LT_OBJDIR ".libs/"
# | #define BUILD "x86_64-pc-linux-gnu"
# | #define HOST "x86_64-unknown-linux-gnu"
# | #define TARGET "x86_64-unknown-linux-gnu"
# | #define CA_BUNDLE "/etc/ssl/certs/ca-certificates.crt"
# | #define CXX11_OVERRIDE override
# | #define HAVE_ZLIB 1
# | #define HAVE_SQLITE3 1
# | #define HAVE_LIBGNUTLS 1
# | #define HAVE_LIBGCRYPT 1
# | #define HAVE_LIBSSH2 1
# | #define HAVE_LIBCARES 1
# | #define HAVE_ARES_ADDR_NODE 1
# | #define HAVE_ARES_SET_SERVERS 1
# | #define USE_LIBGCRYPT_MD 1
# | #define ENABLE_SSL 1
# | #define ENABLE_BITTORRENT 1
# | #define ENABLE_ASYNC_DNS 1
# | #define HAVE_ALLOCA_H 1
# | #define HAVE_ALLOCA 1
# | #define STDC_HEADERS 1
# | #define HAVE_ARPA_INET_H 1
# | #define HAVE_FCNTL_H 1
# | #define HAVE_FLOAT_H 1
# | #define HAVE_INTTYPES_H 1
# | #define HAVE_LANGINFO_H 1
# | #define HAVE_LIBINTL_H 1
# | #define HAVE_LIMITS_H 1
# | #define HAVE_LOCALE_H 1
# | #define HAVE_MALLOC_H 1
# | #define HAVE_NETDB_H 1
# | #define HAVE_NETINET_IN_H 1
# | #define HAVE_NETINET_TCP_H 1
# | #define HAVE_POLL_H 1
# | #define HAVE_SIGNAL_H 1
# | #define HAVE_STDDEF_H 1
# | #define HAVE_STDINT_H 1
# | #define HAVE_STDIO_EXT_H 1
# | #define HAVE_STDLIB_H 1
# | #define HAVE_STRING_H 1
# | #define HAVE_STRINGS_H 1
# | #define HAVE_SYS_IOCTL_H 1
# | #define HAVE_SYS_PARAM_H 1
# | #define HAVE_SYS_RESOURCE_H 1
# | #define HAVE_SYS_SIGNAL_H 1
# | #define HAVE_SYS_SOCKET_H 1
# | #define HAVE_SYS_TIME_H 1
# | #define HAVE_SYS_TYPES_H 1
# | #define HAVE_SYS_UIO_H 1
# | #define HAVE_SYS_UTSNAME_H 1
# | #define HAVE_TERMIOS_H 1
# | #define HAVE_UNISTD_H 1
# | #define HAVE_UTIME_H 1
# | #define HAVE_WCHAR_H 1
# | #define HAVE_IFADDRS_H 1
# | #define HAVE_PWD_H 1
# | #define HAVE_STDBOOL_H 1
# | /* end confdefs.h. */
# | #include
# | #ifdef HAVE_SYS_TYPES_H
# | # include
# | #endif
# | #ifdef HAVE_SYS_STAT_H
# | # include
# | #endif
# | #ifdef STDC_HEADERS
# | # include
# | # include
# | #else
# | # ifdef HAVE_STDLIB_H
# | # include
# | # endif
# | #endif
# | #ifdef HAVE_STRING_H
# | # if !defined STDC_HEADERS && defined HAVE_MEMORY_H
# | # include
# | # endif
# | # include
# | #endif
# | #ifdef HAVE_STRINGS_H
# | # include
# | #endif
# | #ifdef HAVE_INTTYPES_H
# | # include
# | #endif
# | #ifdef HAVE_STDINT_H
# | # include
# | #endif
# | #ifdef HAVE_UNISTD_H
# | # include
# | #endif
# | enum { N = 64 / 2 - 1 };
# | int
# | main ()
# | {
# | static int test_array [1 - 2 * !((int64_t) (((((int64_t) 1 << N) << N) - 1) * 2 + 1)
# | < (int64_t) (((((int64_t) 1 << N) << N) - 1) * 2 + 2))];
# | test_array [0] = 0;
# | return test_array [0];
# |
# | ;
# | return 0;
# | }
# configure:21703: result: yes
# configure:21714: checking for int8_t
# configure:21714: clang++ -c conftest.cpp >&5
# configure:21714: $? = 0
# configure:21714: clang++ -c conftest.cpp >&5
# conftest.cpp:121:24: error: 'test_array' declared as an array with a negative size
# static int test_array [1 - 2 * !((int8_t) (((((int8_t) 1 << N) << N) - 1) * 2 + 1)
# ^~~~~~~~~~~~~~~~~~~~~~~~~~~~~~~~~~~~~~~~~~~~~~~~~~~~~~~~~~~
# 1 error generated.
# configure:21714: $? = 1
# configure: failed program was:
# | /* confdefs.h */
# | #define PACKAGE_NAME "aria2"
# | #define PACKAGE_TARNAME "aria2"
# | #define PACKAGE_VERSION "1.24.0"
# | #define PACKAGE_STRING "aria2 1.24.0"
# | #define PACKAGE_BUGREPORT "https://github.com/aria2/aria2/issues"
# | #define PACKAGE_URL "https://aria2.github.io/"
# | #define PACKAGE "aria2"
# | #define VERSION "1.24.0"
# | #define STDC_HEADERS 1
# | #define HAVE_SYS_TYPES_H 1
# | #define HAVE_SYS_STAT_H 1
# | #define HAVE_STDLIB_H 1
# | #define HAVE_STRING_H 1
# | #define HAVE_MEMORY_H 1
# | #define HAVE_STRINGS_H 1
# | #define HAVE_INTTYPES_H 1
# | #define HAVE_STDINT_H 1
# | #define HAVE_UNISTD_H 1
# | #define __EXTENSIONS__ 1
# | #define _ALL_SOURCE 1
# | #define _GNU_SOURCE 1
# | #define _POSIX_PTHREAD_SEMANTICS 1
# | #define _TANDEM_SOURCE 1
# | #define HAVE_DLFCN_H 1
# | #define LT_OBJDIR ".libs/"
# | #define BUILD "x86_64-pc-linux-gnu"
# | #define HOST "x86_64-unknown-linux-gnu"
# | #define TARGET "x86_64-unknown-linux-gnu"
# | #define CA_BUNDLE "/etc/ssl/certs/ca-certificates.crt"
# | #define CXX11_OVERRIDE override
# | #define HAVE_ZLIB 1
# | #define HAVE_SQLITE3 1
# | #define HAVE_LIBGNUTLS 1
# | #define HAVE_LIBGCRYPT 1
# | #define HAVE_LIBSSH2 1
# | #define HAVE_LIBCARES 1
# | #define HAVE_ARES_ADDR_NODE 1
# | #define HAVE_ARES_SET_SERVERS 1
# | #define USE_LIBGCRYPT_MD 1
# | #define ENABLE_SSL 1
# | #define ENABLE_BITTORRENT 1
# | #define ENABLE_ASYNC_DNS 1
# | #define HAVE_ALLOCA_H 1
# | #define HAVE_ALLOCA 1
# | #define STDC_HEADERS 1
# | #define HAVE_ARPA_INET_H 1
# | #define HAVE_FCNTL_H 1
# | #define HAVE_FLOAT_H 1
# | #define HAVE_INTTYPES_H 1
# | #define HAVE_LANGINFO_H 1
# | #define HAVE_LIBINTL_H 1
# | #define HAVE_LIMITS_H 1
# | #define HAVE_LOCALE_H 1
# | #define HAVE_MALLOC_H 1
# | #define HAVE_NETDB_H 1
# | #define HAVE_NETINET_IN_H 1
# | #define HAVE_NETINET_TCP_H 1
# | #define HAVE_POLL_H 1
# | #define HAVE_SIGNAL_H 1
# | #define HAVE_STDDEF_H 1
# | #define HAVE_STDINT_H 1
# | #define HAVE_STDIO_EXT_H 1
# | #define HAVE_STDLIB_H 1
# | #define HAVE_STRING_H 1
# | #define HAVE_STRINGS_H 1
# | #define HAVE_SYS_IOCTL_H 1
# | #define HAVE_SYS_PARAM_H 1
# | #define HAVE_SYS_RESOURCE_H 1
# | #define HAVE_SYS_SIGNAL_H 1
# | #define HAVE_SYS_SOCKET_H 1
# | #define HAVE_SYS_TIME_H 1
# | #define HAVE_SYS_TYPES_H 1
# | #define HAVE_SYS_UIO_H 1
# | #define HAVE_SYS_UTSNAME_H 1
# | #define HAVE_TERMIOS_H 1
# | #define HAVE_UNISTD_H 1
# | #define HAVE_UTIME_H 1
# | #define HAVE_WCHAR_H 1
# | #define HAVE_IFADDRS_H 1
# | #define HAVE_PWD_H 1
# | #define HAVE_STDBOOL_H 1
# | /* end confdefs.h. */
# | #include
# | #ifdef HAVE_SYS_TYPES_H
# | # include
# | #endif
# | #ifdef HAVE_SYS_STAT_H
# | # include
# | #endif
# | #ifdef STDC_HEADERS
# | # include
# | # include
# | #else
# | # ifdef HAVE_STDLIB_H
# | # include
# | # endif
# | #endif
# | #ifdef HAVE_STRING_H
# | # if !defined STDC_HEADERS && defined HAVE_MEMORY_H
# | # include
# | # endif
# | # include
# | #endif
# | #ifdef HAVE_STRINGS_H
# | # include
# | #endif
# | #ifdef HAVE_INTTYPES_H
# | # include
# | #endif
# | #ifdef HAVE_STDINT_H
# | # include
# | #endif
# | #ifdef HAVE_UNISTD_H
# | # include
# | #endif
# | enum { N = 8 / 2 - 1 };
# | int
# | main ()
# | {
# | static int test_array [1 - 2 * !((int8_t) (((((int8_t) 1 << N) << N) - 1) * 2 + 1)
# | < (int8_t) (((((int8_t) 1 << N) << N) - 1) * 2 + 2))];
# | test_array [0] = 0;
# | return test_array [0];
# |
# | ;
# | return 0;
# | }
# configure:21714: result: yes
# configure:21725: checking for mode_t
# configure:21725: clang++ -c conftest.cpp >&5
# configure:21725: $? = 0
# configure:21725: clang++ -c conftest.cpp >&5
# conftest.cpp:120:21: error: expected expression
# if (sizeof ((mode_t)))
# ^
# 1 error generated.
# configure:21725: $? = 1
# configure: failed program was:
# | /* confdefs.h */
# | #define PACKAGE_NAME "aria2"
# | #define PACKAGE_TARNAME "aria2"
# | #define PACKAGE_VERSION "1.24.0"
# | #define PACKAGE_STRING "aria2 1.24.0"
# | #define PACKAGE_BUGREPORT "https://github.com/aria2/aria2/issues"
# | #define PACKAGE_URL "https://aria2.github.io/"
# | #define PACKAGE "aria2"
# | #define VERSION "1.24.0"
# | #define STDC_HEADERS 1
# | #define HAVE_SYS_TYPES_H 1
# | #define HAVE_SYS_STAT_H 1
# | #define HAVE_STDLIB_H 1
# | #define HAVE_STRING_H 1
# | #define HAVE_MEMORY_H 1
# | #define HAVE_STRINGS_H 1
# | #define HAVE_INTTYPES_H 1
# | #define HAVE_STDINT_H 1
# | #define HAVE_UNISTD_H 1
# | #define __EXTENSIONS__ 1
# | #define _ALL_SOURCE 1
# | #define _GNU_SOURCE 1
# | #define _POSIX_PTHREAD_SEMANTICS 1
# | #define _TANDEM_SOURCE 1
# | #define HAVE_DLFCN_H 1
# | #define LT_OBJDIR ".libs/"
# | #define BUILD "x86_64-pc-linux-gnu"
# | #define HOST "x86_64-unknown-linux-gnu"
# | #define TARGET "x86_64-unknown-linux-gnu"
# | #define CA_BUNDLE "/etc/ssl/certs/ca-certificates.crt"
# | #define CXX11_OVERRIDE override
# | #define HAVE_ZLIB 1
# | #define HAVE_SQLITE3 1
# | #define HAVE_LIBGNUTLS 1
# | #define HAVE_LIBGCRYPT 1
# | #define HAVE_LIBSSH2 1
# | #define HAVE_LIBCARES 1
# | #define HAVE_ARES_ADDR_NODE 1
# | #define HAVE_ARES_SET_SERVERS 1
# | #define USE_LIBGCRYPT_MD 1
# | #define ENABLE_SSL 1
# | #define ENABLE_BITTORRENT 1
# | #define ENABLE_ASYNC_DNS 1
# | #define HAVE_ALLOCA_H 1
# | #define HAVE_ALLOCA 1
# | #define STDC_HEADERS 1
# | #define HAVE_ARPA_INET_H 1
# | #define HAVE_FCNTL_H 1
# | #define HAVE_FLOAT_H 1
# | #define HAVE_INTTYPES_H 1
# | #define HAVE_LANGINFO_H 1
# | #define HAVE_LIBINTL_H 1
# | #define HAVE_LIMITS_H 1
# | #define HAVE_LOCALE_H 1
# | #define HAVE_MALLOC_H 1
# | #define HAVE_NETDB_H 1
# | #define HAVE_NETINET_IN_H 1
# | #define HAVE_NETINET_TCP_H 1
# | #define HAVE_POLL_H 1
# | #define HAVE_SIGNAL_H 1
# | #define HAVE_STDDEF_H 1
# | #define HAVE_STDINT_H 1
# | #define HAVE_STDIO_EXT_H 1
# | #define HAVE_STDLIB_H 1
# | #define HAVE_STRING_H 1
# | #define HAVE_STRINGS_H 1
# | #define HAVE_SYS_IOCTL_H 1
# | #define HAVE_SYS_PARAM_H 1
# | #define HAVE_SYS_RESOURCE_H 1
# | #define HAVE_SYS_SIGNAL_H 1
# | #define HAVE_SYS_SOCKET_H 1
# | #define HAVE_SYS_TIME_H 1
# | #define HAVE_SYS_TYPES_H 1
# | #define HAVE_SYS_UIO_H 1
# | #define HAVE_SYS_UTSNAME_H 1
# | #define HAVE_TERMIOS_H 1
# | #define HAVE_UNISTD_H 1
# | #define HAVE_UTIME_H 1
# | #define HAVE_WCHAR_H 1
# | #define HAVE_IFADDRS_H 1
# | #define HAVE_PWD_H 1
# | #define HAVE_STDBOOL_H 1
# | /* end confdefs.h. */
# | #include
# | #ifdef HAVE_SYS_TYPES_H
# | # include
# | #endif
# | #ifdef HAVE_SYS_STAT_H
# | # include
# | #endif
# | #ifdef STDC_HEADERS
# | # include
# | # include
# | #else
# | # ifdef HAVE_STDLIB_H
# | # include
# | # endif
# | #endif
# | #ifdef HAVE_STRING_H
# | # if !defined STDC_HEADERS && defined HAVE_MEMORY_H
# | # include
# | # endif
# | # include
# | #endif
# | #ifdef HAVE_STRINGS_H
# | # include
# | #endif
# | #ifdef HAVE_INTTYPES_H
# | # include
# | #endif
# | #ifdef HAVE_STDINT_H
# | # include
# | #endif
# | #ifdef HAVE_UNISTD_H
# | # include
# | #endif
# | int
# | main ()
# | {
# | if (sizeof ((mode_t)))
# | return 0;
# | ;
# | return 0;
# | }
# configure:21725: result: yes
# configure:21736: checking for off_t
# configure:21736: clang++ -c conftest.cpp >&5
# configure:21736: $? = 0
# configure:21736: clang++ -c conftest.cpp >&5
# conftest.cpp:120:20: error: expected expression
# if (sizeof ((off_t)))
# ^
# 1 error generated.
# configure:21736: $? = 1
# configure: failed program was:
# | /* confdefs.h */
# | #define PACKAGE_NAME "aria2"
# | #define PACKAGE_TARNAME "aria2"
# | #define PACKAGE_VERSION "1.24.0"
# | #define PACKAGE_STRING "aria2 1.24.0"
# | #define PACKAGE_BUGREPORT "https://github.com/aria2/aria2/issues"
# | #define PACKAGE_URL "https://aria2.github.io/"
# | #define PACKAGE "aria2"
# | #define VERSION "1.24.0"
# | #define STDC_HEADERS 1
# | #define HAVE_SYS_TYPES_H 1
# | #define HAVE_SYS_STAT_H 1
# | #define HAVE_STDLIB_H 1
# | #define HAVE_STRING_H 1
# | #define HAVE_MEMORY_H 1
# | #define HAVE_STRINGS_H 1
# | #define HAVE_INTTYPES_H 1
# | #define HAVE_STDINT_H 1
# | #define HAVE_UNISTD_H 1
# | #define __EXTENSIONS__ 1
# | #define _ALL_SOURCE 1
# | #define _GNU_SOURCE 1
# | #define _POSIX_PTHREAD_SEMANTICS 1
# | #define _TANDEM_SOURCE 1
# | #define HAVE_DLFCN_H 1
# | #define LT_OBJDIR ".libs/"
# | #define BUILD "x86_64-pc-linux-gnu"
# | #define HOST "x86_64-unknown-linux-gnu"
# | #define TARGET "x86_64-unknown-linux-gnu"
# | #define CA_BUNDLE "/etc/ssl/certs/ca-certificates.crt"
# | #define CXX11_OVERRIDE override
# | #define HAVE_ZLIB 1
# | #define HAVE_SQLITE3 1
# | #define HAVE_LIBGNUTLS 1
# | #define HAVE_LIBGCRYPT 1
# | #define HAVE_LIBSSH2 1
# | #define HAVE_LIBCARES 1
# | #define HAVE_ARES_ADDR_NODE 1
# | #define HAVE_ARES_SET_SERVERS 1
# | #define USE_LIBGCRYPT_MD 1
# | #define ENABLE_SSL 1
# | #define ENABLE_BITTORRENT 1
# | #define ENABLE_ASYNC_DNS 1
# | #define HAVE_ALLOCA_H 1
# | #define HAVE_ALLOCA 1
# | #define STDC_HEADERS 1
# | #define HAVE_ARPA_INET_H 1
# | #define HAVE_FCNTL_H 1
# | #define HAVE_FLOAT_H 1
# | #define HAVE_INTTYPES_H 1
# | #define HAVE_LANGINFO_H 1
# | #define HAVE_LIBINTL_H 1
# | #define HAVE_LIMITS_H 1
# | #define HAVE_LOCALE_H 1
# | #define HAVE_MALLOC_H 1
# | #define HAVE_NETDB_H 1
# | #define HAVE_NETINET_IN_H 1
# | #define HAVE_NETINET_TCP_H 1
# | #define HAVE_POLL_H 1
# | #define HAVE_SIGNAL_H 1
# | #define HAVE_STDDEF_H 1
# | #define HAVE_STDINT_H 1
# | #define HAVE_STDIO_EXT_H 1
# | #define HAVE_STDLIB_H 1
# | #define HAVE_STRING_H 1
# | #define HAVE_STRINGS_H 1
# | #define HAVE_SYS_IOCTL_H 1
# | #define HAVE_SYS_PARAM_H 1
# | #define HAVE_SYS_RESOURCE_H 1
# | #define HAVE_SYS_SIGNAL_H 1
# | #define HAVE_SYS_SOCKET_H 1
# | #define HAVE_SYS_TIME_H 1
# | #define HAVE_SYS_TYPES_H 1
# | #define HAVE_SYS_UIO_H 1
# | #define HAVE_SYS_UTSNAME_H 1
# | #define HAVE_TERMIOS_H 1
# | #define HAVE_UNISTD_H 1
# | #define HAVE_UTIME_H 1
# | #define HAVE_WCHAR_H 1
# | #define HAVE_IFADDRS_H 1
# | #define HAVE_PWD_H 1
# | #define HAVE_STDBOOL_H 1
# | /* end confdefs.h. */
# | #include
# | #ifdef HAVE_SYS_TYPES_H
# | # include
# | #endif
# | #ifdef HAVE_SYS_STAT_H
# | # include
# | #endif
# | #ifdef STDC_HEADERS
# | # include
# | # include
# | #else
# | # ifdef HAVE_STDLIB_H
# | # include
# | # endif
# | #endif
# | #ifdef HAVE_STRING_H
# | # if !defined STDC_HEADERS && defined HAVE_MEMORY_H
# | # include
# | # endif
# | # include
# | #endif
# | #ifdef HAVE_STRINGS_H
# | # include
# | #endif
# | #ifdef HAVE_INTTYPES_H
# | # include
# | #endif
# | #ifdef HAVE_STDINT_H
# | # include
# | #endif
# | #ifdef HAVE_UNISTD_H
# | # include
# | #endif
# | int
# | main ()
# | {
# | if (sizeof ((off_t)))
# | return 0;
# | ;
# | return 0;
# | }
# configure:21736: result: yes
# configure:21747: checking for size_t
# configure:21747: result: yes
# configure:21758: checking for ssize_t
# configure:21758: clang++ -c conftest.cpp >&5
# configure:21758: $? = 0
# configure:21758: clang++ -c conftest.cpp >&5
# conftest.cpp:120:22: error: expected expression
# if (sizeof ((ssize_t)))
# ^
# 1 error generated.
# configure:21758: $? = 1
# configure: failed program was:
# | /* confdefs.h */
# | #define PACKAGE_NAME "aria2"
# | #define PACKAGE_TARNAME "aria2"
# | #define PACKAGE_VERSION "1.24.0"
# | #define PACKAGE_STRING "aria2 1.24.0"
# | #define PACKAGE_BUGREPORT "https://github.com/aria2/aria2/issues"
# | #define PACKAGE_URL "https://aria2.github.io/"
# | #define PACKAGE "aria2"
# | #define VERSION "1.24.0"
# | #define STDC_HEADERS 1
# | #define HAVE_SYS_TYPES_H 1
# | #define HAVE_SYS_STAT_H 1
# | #define HAVE_STDLIB_H 1
# | #define HAVE_STRING_H 1
# | #define HAVE_MEMORY_H 1
# | #define HAVE_STRINGS_H 1
# | #define HAVE_INTTYPES_H 1
# | #define HAVE_STDINT_H 1
# | #define HAVE_UNISTD_H 1
# | #define __EXTENSIONS__ 1
# | #define _ALL_SOURCE 1
# | #define _GNU_SOURCE 1
# | #define _POSIX_PTHREAD_SEMANTICS 1
# | #define _TANDEM_SOURCE 1
# | #define HAVE_DLFCN_H 1
# | #define LT_OBJDIR ".libs/"
# | #define BUILD "x86_64-pc-linux-gnu"
# | #define HOST "x86_64-unknown-linux-gnu"
# | #define TARGET "x86_64-unknown-linux-gnu"
# | #define CA_BUNDLE "/etc/ssl/certs/ca-certificates.crt"
# | #define CXX11_OVERRIDE override
# | #define HAVE_ZLIB 1
# | #define HAVE_SQLITE3 1
# | #define HAVE_LIBGNUTLS 1
# | #define HAVE_LIBGCRYPT 1
# | #define HAVE_LIBSSH2 1
# | #define HAVE_LIBCARES 1
# | #define HAVE_ARES_ADDR_NODE 1
# | #define HAVE_ARES_SET_SERVERS 1
# | #define USE_LIBGCRYPT_MD 1
# | #define ENABLE_SSL 1
# | #define ENABLE_BITTORRENT 1
# | #define ENABLE_ASYNC_DNS 1
# | #define HAVE_ALLOCA_H 1
# | #define HAVE_ALLOCA 1
# | #define STDC_HEADERS 1
# | #define HAVE_ARPA_INET_H 1
# | #define HAVE_FCNTL_H 1
# | #define HAVE_FLOAT_H 1
# | #define HAVE_INTTYPES_H 1
# | #define HAVE_LANGINFO_H 1
# | #define HAVE_LIBINTL_H 1
# | #define HAVE_LIMITS_H 1
# | #define HAVE_LOCALE_H 1
# | #define HAVE_MALLOC_H 1
# | #define HAVE_NETDB_H 1
# | #define HAVE_NETINET_IN_H 1
# | #define HAVE_NETINET_TCP_H 1
# | #define HAVE_POLL_H 1
# | #define HAVE_SIGNAL_H 1
# | #define HAVE_STDDEF_H 1
# | #define HAVE_STDINT_H 1
# | #define HAVE_STDIO_EXT_H 1
# | #define HAVE_STDLIB_H 1
# | #define HAVE_STRING_H 1
# | #define HAVE_STRINGS_H 1
# | #define HAVE_SYS_IOCTL_H 1
# | #define HAVE_SYS_PARAM_H 1
# | #define HAVE_SYS_RESOURCE_H 1
# | #define HAVE_SYS_SIGNAL_H 1
# | #define HAVE_SYS_SOCKET_H 1
# | #define HAVE_SYS_TIME_H 1
# | #define HAVE_SYS_TYPES_H 1
# | #define HAVE_SYS_UIO_H 1
# | #define HAVE_SYS_UTSNAME_H 1
# | #define HAVE_TERMIOS_H 1
# | #define HAVE_UNISTD_H 1
# | #define HAVE_UTIME_H 1
# | #define HAVE_WCHAR_H 1
# | #define HAVE_IFADDRS_H 1
# | #define HAVE_PWD_H 1
# | #define HAVE_STDBOOL_H 1
# | /* end confdefs.h. */
# | #include
# | #ifdef HAVE_SYS_TYPES_H
# | # include
# | #endif
# | #ifdef HAVE_SYS_STAT_H
# | # include
# | #endif
# | #ifdef STDC_HEADERS
# | # include
# | # include
# | #else
# | # ifdef HAVE_STDLIB_H
# | # include
# | # endif
# | #endif
# | #ifdef HAVE_STRING_H
# | # if !defined STDC_HEADERS && defined HAVE_MEMORY_H
# | # include
# | # endif
# | # include
# | #endif
# | #ifdef HAVE_STRINGS_H
# | # include
# | #endif
# | #ifdef HAVE_INTTYPES_H
# | # include
# | #endif
# | #ifdef HAVE_STDINT_H
# | # include
# | #endif
# | #ifdef HAVE_UNISTD_H
# | # include
# | #endif
# | int
# | main ()
# | {
# | if (sizeof ((ssize_t)))
# | return 0;
# | ;
# | return 0;
# | }
# configure:21758: result: yes
# configure:21769: checking whether time.h and sys/time.h may both be included
# configure:21789: clang++ -c conftest.cpp >&5
# configure:21789: $? = 0
# configure:21796: result: yes
# configure:21804: checking whether struct tm is in sys/time.h or time.h
# configure:21824: clang++ -c conftest.cpp >&5
# configure:21824: $? = 0
# configure:21831: result: time.h
# configure:21839: checking for uint16_t
# configure:21839: clang++ -c conftest.cpp >&5
# configure:21839: $? = 0
# configure:21839: result: yes
# configure:21851: checking for uint32_t
# configure:21851: clang++ -c conftest.cpp >&5
# configure:21851: $? = 0
# configure:21851: result: yes
# configure:21865: checking for uint64_t
# configure:21865: clang++ -c conftest.cpp >&5
# configure:21865: $? = 0
# configure:21865: result: yes
# configure:21879: checking for uint8_t
# configure:21879: clang++ -c conftest.cpp >&5
# configure:21879: $? = 0
# configure:21879: result: yes
# configure:21893: checking for pid_t
# configure:21893: clang++ -c conftest.cpp >&5
# configure:21893: $? = 0
# configure:21893: clang++ -c conftest.cpp >&5
# conftest.cpp:121:20: error: expected expression
# if (sizeof ((pid_t)))
# ^
# 1 error generated.
# configure:21893: $? = 1
# configure: failed program was:
# | /* confdefs.h */
# | #define PACKAGE_NAME "aria2"
# | #define PACKAGE_TARNAME "aria2"
# | #define PACKAGE_VERSION "1.24.0"
# | #define PACKAGE_STRING "aria2 1.24.0"
# | #define PACKAGE_BUGREPORT "https://github.com/aria2/aria2/issues"
# | #define PACKAGE_URL "https://aria2.github.io/"
# | #define PACKAGE "aria2"
# | #define VERSION "1.24.0"
# | #define STDC_HEADERS 1
# | #define HAVE_SYS_TYPES_H 1
# | #define HAVE_SYS_STAT_H 1
# | #define HAVE_STDLIB_H 1
# | #define HAVE_STRING_H 1
# | #define HAVE_MEMORY_H 1
# | #define HAVE_STRINGS_H 1
# | #define HAVE_INTTYPES_H 1
# | #define HAVE_STDINT_H 1
# | #define HAVE_UNISTD_H 1
# | #define __EXTENSIONS__ 1
# | #define _ALL_SOURCE 1
# | #define _GNU_SOURCE 1
# | #define _POSIX_PTHREAD_SEMANTICS 1
# | #define _TANDEM_SOURCE 1
# | #define HAVE_DLFCN_H 1
# | #define LT_OBJDIR ".libs/"
# | #define BUILD "x86_64-pc-linux-gnu"
# | #define HOST "x86_64-unknown-linux-gnu"
# | #define TARGET "x86_64-unknown-linux-gnu"
# | #define CA_BUNDLE "/etc/ssl/certs/ca-certificates.crt"
# | #define CXX11_OVERRIDE override
# | #define HAVE_ZLIB 1
# | #define HAVE_SQLITE3 1
# | #define HAVE_LIBGNUTLS 1
# | #define HAVE_LIBGCRYPT 1
# | #define HAVE_LIBSSH2 1
# | #define HAVE_LIBCARES 1
# | #define HAVE_ARES_ADDR_NODE 1
# | #define HAVE_ARES_SET_SERVERS 1
# | #define USE_LIBGCRYPT_MD 1
# | #define ENABLE_SSL 1
# | #define ENABLE_BITTORRENT 1
# | #define ENABLE_ASYNC_DNS 1
# | #define HAVE_ALLOCA_H 1
# | #define HAVE_ALLOCA 1
# | #define STDC_HEADERS 1
# | #define HAVE_ARPA_INET_H 1
# | #define HAVE_FCNTL_H 1
# | #define HAVE_FLOAT_H 1
# | #define HAVE_INTTYPES_H 1
# | #define HAVE_LANGINFO_H 1
# | #define HAVE_LIBINTL_H 1
# | #define HAVE_LIMITS_H 1
# | #define HAVE_LOCALE_H 1
# | #define HAVE_MALLOC_H 1
# | #define HAVE_NETDB_H 1
# | #define HAVE_NETINET_IN_H 1
# | #define HAVE_NETINET_TCP_H 1
# | #define HAVE_POLL_H 1
# | #define HAVE_SIGNAL_H 1
# | #define HAVE_STDDEF_H 1
# | #define HAVE_STDINT_H 1
# | #define HAVE_STDIO_EXT_H 1
# | #define HAVE_STDLIB_H 1
# | #define HAVE_STRING_H 1
# | #define HAVE_STRINGS_H 1
# | #define HAVE_SYS_IOCTL_H 1
# | #define HAVE_SYS_PARAM_H 1
# | #define HAVE_SYS_RESOURCE_H 1
# | #define HAVE_SYS_SIGNAL_H 1
# | #define HAVE_SYS_SOCKET_H 1
# | #define HAVE_SYS_TIME_H 1
# | #define HAVE_SYS_TYPES_H 1
# | #define HAVE_SYS_UIO_H 1
# | #define HAVE_SYS_UTSNAME_H 1
# | #define HAVE_TERMIOS_H 1
# | #define HAVE_UNISTD_H 1
# | #define HAVE_UTIME_H 1
# | #define HAVE_WCHAR_H 1
# | #define HAVE_IFADDRS_H 1
# | #define HAVE_PWD_H 1
# | #define HAVE_STDBOOL_H 1
# | #define TIME_WITH_SYS_TIME 1
# | /* end confdefs.h. */
# | #include
# | #ifdef HAVE_SYS_TYPES_H
# | # include
# | #endif
# | #ifdef HAVE_SYS_STAT_H
# | # include
# | #endif
# | #ifdef STDC_HEADERS
# | # include
# | # include
# | #else
# | # ifdef HAVE_STDLIB_H
# | # include
# | # endif
# | #endif
# | #ifdef HAVE_STRING_H
# | # if !defined STDC_HEADERS && defined HAVE_MEMORY_H
# | # include
# | # endif
# | # include
# | #endif
# | #ifdef HAVE_STRINGS_H
# | # include
# | #endif
# | #ifdef HAVE_INTTYPES_H
# | # include
# | #endif
# | #ifdef HAVE_STDINT_H
# | # include
# | #endif
# | #ifdef HAVE_UNISTD_H
# | # include
# | #endif
# | int
# | main ()
# | {
# | if (sizeof ((pid_t)))
# | return 0;
# | ;
# | return 0;
# | }
# configure:21893: result: yes
# configure:21904: checking for working volatile
# configure:21923: clang++ -c conftest.cpp >&5
# configure:21923: $? = 0
# configure:21930: result: yes
# configure:21938: checking for ptrdiff_t
# configure:21938: clang++ -c conftest.cpp >&5
# configure:21938: $? = 0
# configure:21938: clang++ -c conftest.cpp >&5
# conftest.cpp:121:24: error: expected expression
# if (sizeof ((ptrdiff_t)))
# ^
# 1 error generated.
# configure:21938: $? = 1
# configure: failed program was:
# | /* confdefs.h */
# | #define PACKAGE_NAME "aria2"
# | #define PACKAGE_TARNAME "aria2"
# | #define PACKAGE_VERSION "1.24.0"
# | #define PACKAGE_STRING "aria2 1.24.0"
# | #define PACKAGE_BUGREPORT "https://github.com/aria2/aria2/issues"
# | #define PACKAGE_URL "https://aria2.github.io/"
# | #define PACKAGE "aria2"
# | #define VERSION "1.24.0"
# | #define STDC_HEADERS 1
# | #define HAVE_SYS_TYPES_H 1
# | #define HAVE_SYS_STAT_H 1
# | #define HAVE_STDLIB_H 1
# | #define HAVE_STRING_H 1
# | #define HAVE_MEMORY_H 1
# | #define HAVE_STRINGS_H 1
# | #define HAVE_INTTYPES_H 1
# | #define HAVE_STDINT_H 1
# | #define HAVE_UNISTD_H 1
# | #define __EXTENSIONS__ 1
# | #define _ALL_SOURCE 1
# | #define _GNU_SOURCE 1
# | #define _POSIX_PTHREAD_SEMANTICS 1
# | #define _TANDEM_SOURCE 1
# | #define HAVE_DLFCN_H 1
# | #define LT_OBJDIR ".libs/"
# | #define BUILD "x86_64-pc-linux-gnu"
# | #define HOST "x86_64-unknown-linux-gnu"
# | #define TARGET "x86_64-unknown-linux-gnu"
# | #define CA_BUNDLE "/etc/ssl/certs/ca-certificates.crt"
# | #define CXX11_OVERRIDE override
# | #define HAVE_ZLIB 1
# | #define HAVE_SQLITE3 1
# | #define HAVE_LIBGNUTLS 1
# | #define HAVE_LIBGCRYPT 1
# | #define HAVE_LIBSSH2 1
# | #define HAVE_LIBCARES 1
# | #define HAVE_ARES_ADDR_NODE 1
# | #define HAVE_ARES_SET_SERVERS 1
# | #define USE_LIBGCRYPT_MD 1
# | #define ENABLE_SSL 1
# | #define ENABLE_BITTORRENT 1
# | #define ENABLE_ASYNC_DNS 1
# | #define HAVE_ALLOCA_H 1
# | #define HAVE_ALLOCA 1
# | #define STDC_HEADERS 1
# | #define HAVE_ARPA_INET_H 1
# | #define HAVE_FCNTL_H 1
# | #define HAVE_FLOAT_H 1
# | #define HAVE_INTTYPES_H 1
# | #define HAVE_LANGINFO_H 1
# | #define HAVE_LIBINTL_H 1
# | #define HAVE_LIMITS_H 1
# | #define HAVE_LOCALE_H 1
# | #define HAVE_MALLOC_H 1
# | #define HAVE_NETDB_H 1
# | #define HAVE_NETINET_IN_H 1
# | #define HAVE_NETINET_TCP_H 1
# | #define HAVE_POLL_H 1
# | #define HAVE_SIGNAL_H 1
# | #define HAVE_STDDEF_H 1
# | #define HAVE_STDINT_H 1
# | #define HAVE_STDIO_EXT_H 1
# | #define HAVE_STDLIB_H 1
# | #define HAVE_STRING_H 1
# | #define HAVE_STRINGS_H 1
# | #define HAVE_SYS_IOCTL_H 1
# | #define HAVE_SYS_PARAM_H 1
# | #define HAVE_SYS_RESOURCE_H 1
# | #define HAVE_SYS_SIGNAL_H 1
# | #define HAVE_SYS_SOCKET_H 1
# | #define HAVE_SYS_TIME_H 1
# | #define HAVE_SYS_TYPES_H 1
# | #define HAVE_SYS_UIO_H 1
# | #define HAVE_SYS_UTSNAME_H 1
# | #define HAVE_TERMIOS_H 1
# | #define HAVE_UNISTD_H 1
# | #define HAVE_UTIME_H 1
# | #define HAVE_WCHAR_H 1
# | #define HAVE_IFADDRS_H 1
# | #define HAVE_PWD_H 1
# | #define HAVE_STDBOOL_H 1
# | #define TIME_WITH_SYS_TIME 1
# | /* end confdefs.h. */
# | #include
# | #ifdef HAVE_SYS_TYPES_H
# | # include
# | #endif
# | #ifdef HAVE_SYS_STAT_H
# | # include
# | #endif
# | #ifdef STDC_HEADERS
# | # include
# | # include
# | #else
# | # ifdef HAVE_STDLIB_H
# | # include
# | # endif
# | #endif
# | #ifdef HAVE_STRING_H
# | # if !defined STDC_HEADERS && defined HAVE_MEMORY_H
# | # include
# | # endif
# | # include
# | #endif
# | #ifdef HAVE_STRINGS_H
# | # include
# | #endif
# | #ifdef HAVE_INTTYPES_H
# | # include
# | #endif
# | #ifdef HAVE_STDINT_H
# | # include
# | #endif
# | #ifdef HAVE_UNISTD_H
# | # include
# | #endif
# | int
# | main ()
# | {
# | if (sizeof ((ptrdiff_t)))
# | return 0;
# | ;
# | return 0;
# | }
# configure:21938: result: yes
# configure:21948: checking for struct timespec
# configure:21948: clang++ -c conftest.cpp >&5
# configure:21948: $? = 0
# configure:21948: clang++ -c conftest.cpp >&5
# conftest.cpp:122:30: error: expected expression
# if (sizeof ((struct timespec)))
# ^
# 1 error generated.
# configure:21948: $? = 1
# configure: failed program was:
# | /* confdefs.h */
# | #define PACKAGE_NAME "aria2"
# | #define PACKAGE_TARNAME "aria2"
# | #define PACKAGE_VERSION "1.24.0"
# | #define PACKAGE_STRING "aria2 1.24.0"
# | #define PACKAGE_BUGREPORT "https://github.com/aria2/aria2/issues"
# | #define PACKAGE_URL "https://aria2.github.io/"
# | #define PACKAGE "aria2"
# | #define VERSION "1.24.0"
# | #define STDC_HEADERS 1
# | #define HAVE_SYS_TYPES_H 1
# | #define HAVE_SYS_STAT_H 1
# | #define HAVE_STDLIB_H 1
# | #define HAVE_STRING_H 1
# | #define HAVE_MEMORY_H 1
# | #define HAVE_STRINGS_H 1
# | #define HAVE_INTTYPES_H 1
# | #define HAVE_STDINT_H 1
# | #define HAVE_UNISTD_H 1
# | #define __EXTENSIONS__ 1
# | #define _ALL_SOURCE 1
# | #define _GNU_SOURCE 1
# | #define _POSIX_PTHREAD_SEMANTICS 1
# | #define _TANDEM_SOURCE 1
# | #define HAVE_DLFCN_H 1
# | #define LT_OBJDIR ".libs/"
# | #define BUILD "x86_64-pc-linux-gnu"
# | #define HOST "x86_64-unknown-linux-gnu"
# | #define TARGET "x86_64-unknown-linux-gnu"
# | #define CA_BUNDLE "/etc/ssl/certs/ca-certificates.crt"
# | #define CXX11_OVERRIDE override
# | #define HAVE_ZLIB 1
# | #define HAVE_SQLITE3 1
# | #define HAVE_LIBGNUTLS 1
# | #define HAVE_LIBGCRYPT 1
# | #define HAVE_LIBSSH2 1
# | #define HAVE_LIBCARES 1
# | #define HAVE_ARES_ADDR_NODE 1
# | #define HAVE_ARES_SET_SERVERS 1
# | #define USE_LIBGCRYPT_MD 1
# | #define ENABLE_SSL 1
# | #define ENABLE_BITTORRENT 1
# | #define ENABLE_ASYNC_DNS 1
# | #define HAVE_ALLOCA_H 1
# | #define HAVE_ALLOCA 1
# | #define STDC_HEADERS 1
# | #define HAVE_ARPA_INET_H 1
# | #define HAVE_FCNTL_H 1
# | #define HAVE_FLOAT_H 1
# | #define HAVE_INTTYPES_H 1
# | #define HAVE_LANGINFO_H 1
# | #define HAVE_LIBINTL_H 1
# | #define HAVE_LIMITS_H 1
# | #define HAVE_LOCALE_H 1
# | #define HAVE_MALLOC_H 1
# | #define HAVE_NETDB_H 1
# | #define HAVE_NETINET_IN_H 1
# | #define HAVE_NETINET_TCP_H 1
# | #define HAVE_POLL_H 1
# | #define HAVE_SIGNAL_H 1
# | #define HAVE_STDDEF_H 1
# | #define HAVE_STDINT_H 1
# | #define HAVE_STDIO_EXT_H 1
# | #define HAVE_STDLIB_H 1
# | #define HAVE_STRING_H 1
# | #define HAVE_STRINGS_H 1
# | #define HAVE_SYS_IOCTL_H 1
# | #define HAVE_SYS_PARAM_H 1
# | #define HAVE_SYS_RESOURCE_H 1
# | #define HAVE_SYS_SIGNAL_H 1
# | #define HAVE_SYS_SOCKET_H 1
# | #define HAVE_SYS_TIME_H 1
# | #define HAVE_SYS_TYPES_H 1
# | #define HAVE_SYS_UIO_H 1
# | #define HAVE_SYS_UTSNAME_H 1
# | #define HAVE_TERMIOS_H 1
# | #define HAVE_UNISTD_H 1
# | #define HAVE_UTIME_H 1
# | #define HAVE_WCHAR_H 1
# | #define HAVE_IFADDRS_H 1
# | #define HAVE_PWD_H 1
# | #define HAVE_STDBOOL_H 1
# | #define TIME_WITH_SYS_TIME 1
# | #define HAVE_PTRDIFF_T 1
# | /* end confdefs.h. */
# | #include
# | #ifdef HAVE_SYS_TYPES_H
# | # include
# | #endif
# | #ifdef HAVE_SYS_STAT_H
# | # include
# | #endif
# | #ifdef STDC_HEADERS
# | # include
# | # include
# | #else
# | # ifdef HAVE_STDLIB_H
# | # include
# | # endif
# | #endif
# | #ifdef HAVE_STRING_H
# | # if !defined STDC_HEADERS && defined HAVE_MEMORY_H
# | # include
# | # endif
# | # include
# | #endif
# | #ifdef HAVE_STRINGS_H
# | # include
# | #endif
# | #ifdef HAVE_INTTYPES_H
# | # include
# | #endif
# | #ifdef HAVE_STDINT_H
# | # include
# | #endif
# | #ifdef HAVE_UNISTD_H
# | # include
# | #endif
# | int
# | main ()
# | {
# | if (sizeof ((struct timespec)))
# | return 0;
# | ;
# | return 0;
# | }
# configure:21948: result: yes
# configure:21955: checking whether byte ordering is bigendian
# configure:21970: clang++ -c conftest.cpp >&5
# conftest.cpp:87:9: error: expected unqualified-id
# not a universal capable compiler
# ^
# 1 error generated.
# configure:21970: $? = 1
# configure: failed program was:
# | /* confdefs.h */
# | #define PACKAGE_NAME "aria2"
# | #define PACKAGE_TARNAME "aria2"
# | #define PACKAGE_VERSION "1.24.0"
# | #define PACKAGE_STRING "aria2 1.24.0"
# | #define PACKAGE_BUGREPORT "https://github.com/aria2/aria2/issues"
# | #define PACKAGE_URL "https://aria2.github.io/"
# | #define PACKAGE "aria2"
# | #define VERSION "1.24.0"
# | #define STDC_HEADERS 1
# | #define HAVE_SYS_TYPES_H 1
# | #define HAVE_SYS_STAT_H 1
# | #define HAVE_STDLIB_H 1
# | #define HAVE_STRING_H 1
# | #define HAVE_MEMORY_H 1
# | #define HAVE_STRINGS_H 1
# | #define HAVE_INTTYPES_H 1
# | #define HAVE_STDINT_H 1
# | #define HAVE_UNISTD_H 1
# | #define __EXTENSIONS__ 1
# | #define _ALL_SOURCE 1
# | #define _GNU_SOURCE 1
# | #define _POSIX_PTHREAD_SEMANTICS 1
# | #define _TANDEM_SOURCE 1
# | #define HAVE_DLFCN_H 1
# | #define LT_OBJDIR ".libs/"
# | #define BUILD "x86_64-pc-linux-gnu"
# | #define HOST "x86_64-unknown-linux-gnu"
# | #define TARGET "x86_64-unknown-linux-gnu"
# | #define CA_BUNDLE "/etc/ssl/certs/ca-certificates.crt"
# | #define CXX11_OVERRIDE override
# | #define HAVE_ZLIB 1
# | #define HAVE_SQLITE3 1
# | #define HAVE_LIBGNUTLS 1
# | #define HAVE_LIBGCRYPT 1
# | #define HAVE_LIBSSH2 1
# | #define HAVE_LIBCARES 1
# | #define HAVE_ARES_ADDR_NODE 1
# | #define HAVE_ARES_SET_SERVERS 1
# | #define USE_LIBGCRYPT_MD 1
# | #define ENABLE_SSL 1
# | #define ENABLE_BITTORRENT 1
# | #define ENABLE_ASYNC_DNS 1
# | #define HAVE_ALLOCA_H 1
# | #define HAVE_ALLOCA 1
# | #define STDC_HEADERS 1
# | #define HAVE_ARPA_INET_H 1
# | #define HAVE_FCNTL_H 1
# | #define HAVE_FLOAT_H 1
# | #define HAVE_INTTYPES_H 1
# | #define HAVE_LANGINFO_H 1
# | #define HAVE_LIBINTL_H 1
# | #define HAVE_LIMITS_H 1
# | #define HAVE_LOCALE_H 1
# | #define HAVE_MALLOC_H 1
# | #define HAVE_NETDB_H 1
# | #define HAVE_NETINET_IN_H 1
# | #define HAVE_NETINET_TCP_H 1
# | #define HAVE_POLL_H 1
# | #define HAVE_SIGNAL_H 1
# | #define HAVE_STDDEF_H 1
# | #define HAVE_STDINT_H 1
# | #define HAVE_STDIO_EXT_H 1
# | #define HAVE_STDLIB_H 1
# | #define HAVE_STRING_H 1
# | #define HAVE_STRINGS_H 1
# | #define HAVE_SYS_IOCTL_H 1
# | #define HAVE_SYS_PARAM_H 1
# | #define HAVE_SYS_RESOURCE_H 1
# | #define HAVE_SYS_SIGNAL_H 1
# | #define HAVE_SYS_SOCKET_H 1
# | #define HAVE_SYS_TIME_H 1
# | #define HAVE_SYS_TYPES_H 1
# | #define HAVE_SYS_UIO_H 1
# | #define HAVE_SYS_UTSNAME_H 1
# | #define HAVE_TERMIOS_H 1
# | #define HAVE_UNISTD_H 1
# | #define HAVE_UTIME_H 1
# | #define HAVE_WCHAR_H 1
# | #define HAVE_IFADDRS_H 1
# | #define HAVE_PWD_H 1
# | #define HAVE_STDBOOL_H 1
# | #define TIME_WITH_SYS_TIME 1
# | #define HAVE_PTRDIFF_T 1
# | /* end confdefs.h. */
# | #ifndef __APPLE_CC__
# | not a universal capable compiler
# | #endif
# | typedef int dummy;
# |
# configure:22015: clang++ -c conftest.cpp >&5
# configure:22015: $? = 0
# configure:22033: clang++ -c conftest.cpp >&5
# conftest.cpp:93:11: error: expected ';' after expression
# not big endian
# ^
# ;
# conftest.cpp:93:8: error: use of undeclared identifier 'big'
# not big endian
# ^
# conftest.cpp:93:12: error: use of undeclared identifier 'endian'
# not big endian
# ^
# 3 errors generated.
# configure:22033: $? = 1
# configure: failed program was:
# | /* confdefs.h */
# | #define PACKAGE_NAME "aria2"
# | #define PACKAGE_TARNAME "aria2"
# | #define PACKAGE_VERSION "1.24.0"
# | #define PACKAGE_STRING "aria2 1.24.0"
# | #define PACKAGE_BUGREPORT "https://github.com/aria2/aria2/issues"
# | #define PACKAGE_URL "https://aria2.github.io/"
# | #define PACKAGE "aria2"
# | #define VERSION "1.24.0"
# | #define STDC_HEADERS 1
# | #define HAVE_SYS_TYPES_H 1
# | #define HAVE_SYS_STAT_H 1
# | #define HAVE_STDLIB_H 1
# | #define HAVE_STRING_H 1
# | #define HAVE_MEMORY_H 1
# | #define HAVE_STRINGS_H 1
# | #define HAVE_INTTYPES_H 1
# | #define HAVE_STDINT_H 1
# | #define HAVE_UNISTD_H 1
# | #define __EXTENSIONS__ 1
# | #define _ALL_SOURCE 1
# | #define _GNU_SOURCE 1
# | #define _POSIX_PTHREAD_SEMANTICS 1
# | #define _TANDEM_SOURCE 1
# | #define HAVE_DLFCN_H 1
# | #define LT_OBJDIR ".libs/"
# | #define BUILD "x86_64-pc-linux-gnu"
# | #define HOST "x86_64-unknown-linux-gnu"
# | #define TARGET "x86_64-unknown-linux-gnu"
# | #define CA_BUNDLE "/etc/ssl/certs/ca-certificates.crt"
# | #define CXX11_OVERRIDE override
# | #define HAVE_ZLIB 1
# | #define HAVE_SQLITE3 1
# | #define HAVE_LIBGNUTLS 1
# | #define HAVE_LIBGCRYPT 1
# | #define HAVE_LIBSSH2 1
# | #define HAVE_LIBCARES 1
# | #define HAVE_ARES_ADDR_NODE 1
# | #define HAVE_ARES_SET_SERVERS 1
# | #define USE_LIBGCRYPT_MD 1
# | #define ENABLE_SSL 1
# | #define ENABLE_BITTORRENT 1
# | #define ENABLE_ASYNC_DNS 1
# | #define HAVE_ALLOCA_H 1
# | #define HAVE_ALLOCA 1
# | #define STDC_HEADERS 1
# | #define HAVE_ARPA_INET_H 1
# | #define HAVE_FCNTL_H 1
# | #define HAVE_FLOAT_H 1
# | #define HAVE_INTTYPES_H 1
# | #define HAVE_LANGINFO_H 1
# | #define HAVE_LIBINTL_H 1
# | #define HAVE_LIMITS_H 1
# | #define HAVE_LOCALE_H 1
# | #define HAVE_MALLOC_H 1
# | #define HAVE_NETDB_H 1
# | #define HAVE_NETINET_IN_H 1
# | #define HAVE_NETINET_TCP_H 1
# | #define HAVE_POLL_H 1
# | #define HAVE_SIGNAL_H 1
# | #define HAVE_STDDEF_H 1
# | #define HAVE_STDINT_H 1
# | #define HAVE_STDIO_EXT_H 1
# | #define HAVE_STDLIB_H 1
# | #define HAVE_STRING_H 1
# | #define HAVE_STRINGS_H 1
# | #define HAVE_SYS_IOCTL_H 1
# | #define HAVE_SYS_PARAM_H 1
# | #define HAVE_SYS_RESOURCE_H 1
# | #define HAVE_SYS_SIGNAL_H 1
# | #define HAVE_SYS_SOCKET_H 1
# | #define HAVE_SYS_TIME_H 1
# | #define HAVE_SYS_TYPES_H 1
# | #define HAVE_SYS_UIO_H 1
# | #define HAVE_SYS_UTSNAME_H 1
# | #define HAVE_TERMIOS_H 1
# | #define HAVE_UNISTD_H 1
# | #define HAVE_UTIME_H 1
# | #define HAVE_WCHAR_H 1
# | #define HAVE_IFADDRS_H 1
# | #define HAVE_PWD_H 1
# | #define HAVE_STDBOOL_H 1
# | #define TIME_WITH_SYS_TIME 1
# | #define HAVE_PTRDIFF_T 1
# | /* end confdefs.h. */
# | #include
# | #include
# |
# | int
# | main ()
# | {
# | #if BYTE_ORDER != BIG_ENDIAN
# | not big endian
# | #endif
# |
# | ;
# | return 0;
# | }
# configure:22161: result: no
# configure:22186: checking for special C compiler options needed for large files
# configure:22231: result: no
# configure:22237: checking for _FILE_OFFSET_BITS value needed for large files
# configure:22262: clang++ -c conftest.cpp >&5
# configure:22262: $? = 0
# configure:22294: result: no
# configure:22395: checking whether NLS is requested
# configure:22404: result: yes
# configure:22445: checking for msgfmt
# configure: trying /usr/bin/msgfmt...
# 0 translated messages.
# configure:22477: result: /usr/bin/msgfmt
# configure:22486: checking for gmsgfmt
# configure:22517: result: /usr/bin/msgfmt
# configure:22568: checking for xgettext
# configure: trying /usr/bin/xgettext...
# /usr/bin/xgettext: warning: file '/dev/null' extension '' is unknown; will try C
# configure:22600: result: /usr/bin/xgettext
# configure:22646: checking for msgmerge
# configure: trying /usr/bin/msgmerge...
# configure:22677: result: /usr/bin/msgmerge
# configure:22734: checking for ld used by GCC
# configure:22798: result: /sysroot/bin/ld -m elf_x86_64
# configure:22805: checking if the linker (/sysroot/bin/ld -m elf_x86_64) is GNU ld
# configure:22818: result: yes
# configure:22825: checking for shared library run path origin
# configure:22838: result: done
# configure:23410: checking for CFPreferencesCopyAppValue
# configure:23428: clang++ -o conftest conftest.cpp -Wl,-framework -Wl,CoreFoundation >&5
# conftest.cpp:87:10: fatal error: 'CoreFoundation/CFPreferences.h' file not found
# #include
# ^
# 1 error generated.
# configure:23428: $? = 1
# configure: failed program was:
# | /* confdefs.h */
# | #define PACKAGE_NAME "aria2"
# | #define PACKAGE_TARNAME "aria2"
# | #define PACKAGE_VERSION "1.24.0"
# | #define PACKAGE_STRING "aria2 1.24.0"
# | #define PACKAGE_BUGREPORT "https://github.com/aria2/aria2/issues"
# | #define PACKAGE_URL "https://aria2.github.io/"
# | #define PACKAGE "aria2"
# | #define VERSION "1.24.0"
# | #define STDC_HEADERS 1
# | #define HAVE_SYS_TYPES_H 1
# | #define HAVE_SYS_STAT_H 1
# | #define HAVE_STDLIB_H 1
# | #define HAVE_STRING_H 1
# | #define HAVE_MEMORY_H 1
# | #define HAVE_STRINGS_H 1
# | #define HAVE_INTTYPES_H 1
# | #define HAVE_STDINT_H 1
# | #define HAVE_UNISTD_H 1
# | #define __EXTENSIONS__ 1
# | #define _ALL_SOURCE 1
# | #define _GNU_SOURCE 1
# | #define _POSIX_PTHREAD_SEMANTICS 1
# | #define _TANDEM_SOURCE 1
# | #define HAVE_DLFCN_H 1
# | #define LT_OBJDIR ".libs/"
# | #define BUILD "x86_64-pc-linux-gnu"
# | #define HOST "x86_64-unknown-linux-gnu"
# | #define TARGET "x86_64-unknown-linux-gnu"
# | #define CA_BUNDLE "/etc/ssl/certs/ca-certificates.crt"
# | #define CXX11_OVERRIDE override
# | #define HAVE_ZLIB 1
# | #define HAVE_SQLITE3 1
# | #define HAVE_LIBGNUTLS 1
# | #define HAVE_LIBGCRYPT 1
# | #define HAVE_LIBSSH2 1
# | #define HAVE_LIBCARES 1
# | #define HAVE_ARES_ADDR_NODE 1
# | #define HAVE_ARES_SET_SERVERS 1
# | #define USE_LIBGCRYPT_MD 1
# | #define ENABLE_SSL 1
# | #define ENABLE_BITTORRENT 1
# | #define ENABLE_ASYNC_DNS 1
# | #define HAVE_ALLOCA_H 1
# | #define HAVE_ALLOCA 1
# | #define STDC_HEADERS 1
# | #define HAVE_ARPA_INET_H 1
# | #define HAVE_FCNTL_H 1
# | #define HAVE_FLOAT_H 1
# | #define HAVE_INTTYPES_H 1
# | #define HAVE_LANGINFO_H 1
# | #define HAVE_LIBINTL_H 1
# | #define HAVE_LIMITS_H 1
# | #define HAVE_LOCALE_H 1
# | #define HAVE_MALLOC_H 1
# | #define HAVE_NETDB_H 1
# | #define HAVE_NETINET_IN_H 1
# | #define HAVE_NETINET_TCP_H 1
# | #define HAVE_POLL_H 1
# | #define HAVE_SIGNAL_H 1
# | #define HAVE_STDDEF_H 1
# | #define HAVE_STDINT_H 1
# | #define HAVE_STDIO_EXT_H 1
# | #define HAVE_STDLIB_H 1
# | #define HAVE_STRING_H 1
# | #define HAVE_STRINGS_H 1
# | #define HAVE_SYS_IOCTL_H 1
# | #define HAVE_SYS_PARAM_H 1
# | #define HAVE_SYS_RESOURCE_H 1
# | #define HAVE_SYS_SIGNAL_H 1
# | #define HAVE_SYS_SOCKET_H 1
# | #define HAVE_SYS_TIME_H 1
# | #define HAVE_SYS_TYPES_H 1
# | #define HAVE_SYS_UIO_H 1
# | #define HAVE_SYS_UTSNAME_H 1
# | #define HAVE_TERMIOS_H 1
# | #define HAVE_UNISTD_H 1
# | #define HAVE_UTIME_H 1
# | #define HAVE_WCHAR_H 1
# | #define HAVE_IFADDRS_H 1
# | #define HAVE_PWD_H 1
# | #define HAVE_STDBOOL_H 1
# | #define TIME_WITH_SYS_TIME 1
# | #define HAVE_PTRDIFF_T 1
# | #define HAVE_A2_STRUCT_TIMESPEC 1
# | /* end confdefs.h. */
# | #include
# | int
# | main ()
# | {
# | CFPreferencesCopyAppValue(NULL, NULL)
# | ;
# | return 0;
# | }
# configure:23437: result: no
# configure:23444: checking for CFLocaleCopyCurrent
# configure:23462: clang++ -o conftest conftest.cpp -Wl,-framework -Wl,CoreFoundation >&5
# conftest.cpp:87:10: fatal error: 'CoreFoundation/CFLocale.h' file not found
# #include
# ^
# 1 error generated.
# configure:23462: $? = 1
# configure: failed program was:
# | /* confdefs.h */
# | #define PACKAGE_NAME "aria2"
# | #define PACKAGE_TARNAME "aria2"
# | #define PACKAGE_VERSION "1.24.0"
# | #define PACKAGE_STRING "aria2 1.24.0"
# | #define PACKAGE_BUGREPORT "https://github.com/aria2/aria2/issues"
# | #define PACKAGE_URL "https://aria2.github.io/"
# | #define PACKAGE "aria2"
# | #define VERSION "1.24.0"
# | #define STDC_HEADERS 1
# | #define HAVE_SYS_TYPES_H 1
# | #define HAVE_SYS_STAT_H 1
# | #define HAVE_STDLIB_H 1
# | #define HAVE_STRING_H 1
# | #define HAVE_MEMORY_H 1
# | #define HAVE_STRINGS_H 1
# | #define HAVE_INTTYPES_H 1
# | #define HAVE_STDINT_H 1
# | #define HAVE_UNISTD_H 1
# | #define __EXTENSIONS__ 1
# | #define _ALL_SOURCE 1
# | #define _GNU_SOURCE 1
# | #define _POSIX_PTHREAD_SEMANTICS 1
# | #define _TANDEM_SOURCE 1
# | #define HAVE_DLFCN_H 1
# | #define LT_OBJDIR ".libs/"
# | #define BUILD "x86_64-pc-linux-gnu"
# | #define HOST "x86_64-unknown-linux-gnu"
# | #define TARGET "x86_64-unknown-linux-gnu"
# | #define CA_BUNDLE "/etc/ssl/certs/ca-certificates.crt"
# | #define CXX11_OVERRIDE override
# | #define HAVE_ZLIB 1
# | #define HAVE_SQLITE3 1
# | #define HAVE_LIBGNUTLS 1
# | #define HAVE_LIBGCRYPT 1
# | #define HAVE_LIBSSH2 1
# | #define HAVE_LIBCARES 1
# | #define HAVE_ARES_ADDR_NODE 1
# | #define HAVE_ARES_SET_SERVERS 1
# | #define USE_LIBGCRYPT_MD 1
# | #define ENABLE_SSL 1
# | #define ENABLE_BITTORRENT 1
# | #define ENABLE_ASYNC_DNS 1
# | #define HAVE_ALLOCA_H 1
# | #define HAVE_ALLOCA 1
# | #define STDC_HEADERS 1
# | #define HAVE_ARPA_INET_H 1
# | #define HAVE_FCNTL_H 1
# | #define HAVE_FLOAT_H 1
# | #define HAVE_INTTYPES_H 1
# | #define HAVE_LANGINFO_H 1
# | #define HAVE_LIBINTL_H 1
# | #define HAVE_LIMITS_H 1
# | #define HAVE_LOCALE_H 1
# | #define HAVE_MALLOC_H 1
# | #define HAVE_NETDB_H 1
# | #define HAVE_NETINET_IN_H 1
# | #define HAVE_NETINET_TCP_H 1
# | #define HAVE_POLL_H 1
# | #define HAVE_SIGNAL_H 1
# | #define HAVE_STDDEF_H 1
# | #define HAVE_STDINT_H 1
# | #define HAVE_STDIO_EXT_H 1
# | #define HAVE_STDLIB_H 1
# | #define HAVE_STRING_H 1
# | #define HAVE_STRINGS_H 1
# | #define HAVE_SYS_IOCTL_H 1
# | #define HAVE_SYS_PARAM_H 1
# | #define HAVE_SYS_RESOURCE_H 1
# | #define HAVE_SYS_SIGNAL_H 1
# | #define HAVE_SYS_SOCKET_H 1
# | #define HAVE_SYS_TIME_H 1
# | #define HAVE_SYS_TYPES_H 1
# | #define HAVE_SYS_UIO_H 1
# | #define HAVE_SYS_UTSNAME_H 1
# | #define HAVE_TERMIOS_H 1
# | #define HAVE_UNISTD_H 1
# | #define HAVE_UTIME_H 1
# | #define HAVE_WCHAR_H 1
# | #define HAVE_IFADDRS_H 1
# | #define HAVE_PWD_H 1
# | #define HAVE_STDBOOL_H 1
# | #define TIME_WITH_SYS_TIME 1
# | #define HAVE_PTRDIFF_T 1
# | #define HAVE_A2_STRUCT_TIMESPEC 1
# | /* end confdefs.h. */
# | #include
# | int
# | main ()
# | {
# | CFLocaleCopyCurrent();
# | ;
# | return 0;
# | }
# configure:23471: result: no
# configure:23520: checking for GNU gettext in libc
# configure:23540: clang++ -o conftest conftest.cpp >&5
# /tmp/conftest-45ba0b.o:conftest.cpp:function main: error: undefined reference to '_nl_msg_cat_cntr'
# /tmp/conftest-45ba0b.o:conftest.cpp:function main: error: undefined reference to '_nl_domain_bindings'
# clang-3.8: error: linker command failed with exit code 1 (use -v to see invocation)
# configure:23540: $? = 1
# configure: failed program was:
# | /* confdefs.h */
# | #define PACKAGE_NAME "aria2"
# | #define PACKAGE_TARNAME "aria2"
# | #define PACKAGE_VERSION "1.24.0"
# | #define PACKAGE_STRING "aria2 1.24.0"
# | #define PACKAGE_BUGREPORT "https://github.com/aria2/aria2/issues"
# | #define PACKAGE_URL "https://aria2.github.io/"
# | #define PACKAGE "aria2"
# | #define VERSION "1.24.0"
# | #define STDC_HEADERS 1
# | #define HAVE_SYS_TYPES_H 1
# | #define HAVE_SYS_STAT_H 1
# | #define HAVE_STDLIB_H 1
# | #define HAVE_STRING_H 1
# | #define HAVE_MEMORY_H 1
# | #define HAVE_STRINGS_H 1
# | #define HAVE_INTTYPES_H 1
# | #define HAVE_STDINT_H 1
# | #define HAVE_UNISTD_H 1
# | #define __EXTENSIONS__ 1
# | #define _ALL_SOURCE 1
# | #define _GNU_SOURCE 1
# | #define _POSIX_PTHREAD_SEMANTICS 1
# | #define _TANDEM_SOURCE 1
# | #define HAVE_DLFCN_H 1
# | #define LT_OBJDIR ".libs/"
# | #define BUILD "x86_64-pc-linux-gnu"
# | #define HOST "x86_64-unknown-linux-gnu"
# | #define TARGET "x86_64-unknown-linux-gnu"
# | #define CA_BUNDLE "/etc/ssl/certs/ca-certificates.crt"
# | #define CXX11_OVERRIDE override
# | #define HAVE_ZLIB 1
# | #define HAVE_SQLITE3 1
# | #define HAVE_LIBGNUTLS 1
# | #define HAVE_LIBGCRYPT 1
# | #define HAVE_LIBSSH2 1
# | #define HAVE_LIBCARES 1
# | #define HAVE_ARES_ADDR_NODE 1
# | #define HAVE_ARES_SET_SERVERS 1
# | #define USE_LIBGCRYPT_MD 1
# | #define ENABLE_SSL 1
# | #define ENABLE_BITTORRENT 1
# | #define ENABLE_ASYNC_DNS 1
# | #define HAVE_ALLOCA_H 1
# | #define HAVE_ALLOCA 1
# | #define STDC_HEADERS 1
# | #define HAVE_ARPA_INET_H 1
# | #define HAVE_FCNTL_H 1
# | #define HAVE_FLOAT_H 1
# | #define HAVE_INTTYPES_H 1
# | #define HAVE_LANGINFO_H 1
# | #define HAVE_LIBINTL_H 1
# | #define HAVE_LIMITS_H 1
# | #define HAVE_LOCALE_H 1
# | #define HAVE_MALLOC_H 1
# | #define HAVE_NETDB_H 1
# | #define HAVE_NETINET_IN_H 1
# | #define HAVE_NETINET_TCP_H 1
# | #define HAVE_POLL_H 1
# | #define HAVE_SIGNAL_H 1
# | #define HAVE_STDDEF_H 1
# | #define HAVE_STDINT_H 1
# | #define HAVE_STDIO_EXT_H 1
# | #define HAVE_STDLIB_H 1
# | #define HAVE_STRING_H 1
# | #define HAVE_STRINGS_H 1
# | #define HAVE_SYS_IOCTL_H 1
# | #define HAVE_SYS_PARAM_H 1
# | #define HAVE_SYS_RESOURCE_H 1
# | #define HAVE_SYS_SIGNAL_H 1
# | #define HAVE_SYS_SOCKET_H 1
# | #define HAVE_SYS_TIME_H 1
# | #define HAVE_SYS_TYPES_H 1
# | #define HAVE_SYS_UIO_H 1
# | #define HAVE_SYS_UTSNAME_H 1
# | #define HAVE_TERMIOS_H 1
# | #define HAVE_UNISTD_H 1
# | #define HAVE_UTIME_H 1
# | #define HAVE_WCHAR_H 1
# | #define HAVE_IFADDRS_H 1
# | #define HAVE_PWD_H 1
# | #define HAVE_STDBOOL_H 1
# | #define TIME_WITH_SYS_TIME 1
# | #define HAVE_PTRDIFF_T 1
# | #define HAVE_A2_STRUCT_TIMESPEC 1
# | /* end confdefs.h. */
# | #include
# |
# | extern int _nl_msg_cat_cntr;
# | extern int *_nl_domain_bindings;
# | int
# | main ()
# | {
# | bindtextdomain ("", "");
# | return * gettext ("") + _nl_msg_cat_cntr + *_nl_domain_bindings
# | ;
# | return 0;
# | }
# configure:23549: result: no
# configure:23583: checking for iconv
# configure:23605: clang++ -o conftest conftest.cpp >&5
# configure:23605: $? = 0
# configure:23637: result: yes
# configure:23640: checking for working iconv
# configure:23735: clang++ -o conftest conftest.cpp >&5
# configure:23735: $? = 0
# configure:23735: ./conftest
# configure:23735: $? = 0
# configure:23747: result: yes
# configure:24236: checking for GNU gettext in libintl
# configure:24264: clang++ -o conftest conftest.cpp -lintl >&5
# /sysroot/bin/ld: error: cannot find -lintl
# /tmp/conftest-f14710.o:conftest.cpp:function main: error: undefined reference to '_nl_msg_cat_cntr'
# /tmp/conftest-f14710.o:conftest.cpp:function main: error: undefined reference to '_nl_expand_alias'
# clang-3.8: error: linker command failed with exit code 1 (use -v to see invocation)
# configure:24264: $? = 1
# configure: failed program was:
# | /* confdefs.h */
# | #define PACKAGE_NAME "aria2"
# | #define PACKAGE_TARNAME "aria2"
# | #define PACKAGE_VERSION "1.24.0"
# | #define PACKAGE_STRING "aria2 1.24.0"
# | #define PACKAGE_BUGREPORT "https://github.com/aria2/aria2/issues"
# | #define PACKAGE_URL "https://aria2.github.io/"
# | #define PACKAGE "aria2"
# | #define VERSION "1.24.0"
# | #define STDC_HEADERS 1
# | #define HAVE_SYS_TYPES_H 1
# | #define HAVE_SYS_STAT_H 1
# | #define HAVE_STDLIB_H 1
# | #define HAVE_STRING_H 1
# | #define HAVE_MEMORY_H 1
# | #define HAVE_STRINGS_H 1
# | #define HAVE_INTTYPES_H 1
# | #define HAVE_STDINT_H 1
# | #define HAVE_UNISTD_H 1
# | #define __EXTENSIONS__ 1
# | #define _ALL_SOURCE 1
# | #define _GNU_SOURCE 1
# | #define _POSIX_PTHREAD_SEMANTICS 1
# | #define _TANDEM_SOURCE 1
# | #define HAVE_DLFCN_H 1
# | #define LT_OBJDIR ".libs/"
# | #define BUILD "x86_64-pc-linux-gnu"
# | #define HOST "x86_64-unknown-linux-gnu"
# | #define TARGET "x86_64-unknown-linux-gnu"
# | #define CA_BUNDLE "/etc/ssl/certs/ca-certificates.crt"
# | #define CXX11_OVERRIDE override
# | #define HAVE_ZLIB 1
# | #define HAVE_SQLITE3 1
# | #define HAVE_LIBGNUTLS 1
# | #define HAVE_LIBGCRYPT 1
# | #define HAVE_LIBSSH2 1
# | #define HAVE_LIBCARES 1
# | #define HAVE_ARES_ADDR_NODE 1
# | #define HAVE_ARES_SET_SERVERS 1
# | #define USE_LIBGCRYPT_MD 1
# | #define ENABLE_SSL 1
# | #define ENABLE_BITTORRENT 1
# | #define ENABLE_ASYNC_DNS 1
# | #define HAVE_ALLOCA_H 1
# | #define HAVE_ALLOCA 1
# | #define STDC_HEADERS 1
# | #define HAVE_ARPA_INET_H 1
# | #define HAVE_FCNTL_H 1
# | #define HAVE_FLOAT_H 1
# | #define HAVE_INTTYPES_H 1
# | #define HAVE_LANGINFO_H 1
# | #define HAVE_LIBINTL_H 1
# | #define HAVE_LIMITS_H 1
# | #define HAVE_LOCALE_H 1
# | #define HAVE_MALLOC_H 1
# | #define HAVE_NETDB_H 1
# | #define HAVE_NETINET_IN_H 1
# | #define HAVE_NETINET_TCP_H 1
# | #define HAVE_POLL_H 1
# | #define HAVE_SIGNAL_H 1
# | #define HAVE_STDDEF_H 1
# | #define HAVE_STDINT_H 1
# | #define HAVE_STDIO_EXT_H 1
# | #define HAVE_STDLIB_H 1
# | #define HAVE_STRING_H 1
# | #define HAVE_STRINGS_H 1
# | #define HAVE_SYS_IOCTL_H 1
# | #define HAVE_SYS_PARAM_H 1
# | #define HAVE_SYS_RESOURCE_H 1
# | #define HAVE_SYS_SIGNAL_H 1
# | #define HAVE_SYS_SOCKET_H 1
# | #define HAVE_SYS_TIME_H 1
# | #define HAVE_SYS_TYPES_H 1
# | #define HAVE_SYS_UIO_H 1
# | #define HAVE_SYS_UTSNAME_H 1
# | #define HAVE_TERMIOS_H 1
# | #define HAVE_UNISTD_H 1
# | #define HAVE_UTIME_H 1
# | #define HAVE_WCHAR_H 1
# | #define HAVE_IFADDRS_H 1
# | #define HAVE_PWD_H 1
# | #define HAVE_STDBOOL_H 1
# | #define TIME_WITH_SYS_TIME 1
# | #define HAVE_PTRDIFF_T 1
# | #define HAVE_A2_STRUCT_TIMESPEC 1
# | #define HAVE_ICONV 1
# | /* end confdefs.h. */
# | #include
# |
# | extern int _nl_msg_cat_cntr;
# | extern
# | #ifdef __cplusplus
# | "C"
# | #endif
# | const char *_nl_expand_alias (const char *);
# | int
# | main ()
# | {
# | bindtextdomain ("", "");
# | return * gettext ("") + _nl_msg_cat_cntr + *_nl_expand_alias ("")
# | ;
# | return 0;
# | }
# configure:24305: result: no
# configure:24340: checking whether to use NLS
# configure:24342: result: no
# configure:24414: checking for error_at_line
# configure:24430: clang++ -o conftest conftest.cpp >&5
# conftest.cpp:88:10: fatal error: 'error.h' file not found
# #include
# ^
# 1 error generated.
# configure:24430: $? = 1
# configure: failed program was:
# | /* confdefs.h */
# | #define PACKAGE_NAME "aria2"
# | #define PACKAGE_TARNAME "aria2"
# | #define PACKAGE_VERSION "1.24.0"
# | #define PACKAGE_STRING "aria2 1.24.0"
# | #define PACKAGE_BUGREPORT "https://github.com/aria2/aria2/issues"
# | #define PACKAGE_URL "https://aria2.github.io/"
# | #define PACKAGE "aria2"
# | #define VERSION "1.24.0"
# | #define STDC_HEADERS 1
# | #define HAVE_SYS_TYPES_H 1
# | #define HAVE_SYS_STAT_H 1
# | #define HAVE_STDLIB_H 1
# | #define HAVE_STRING_H 1
# | #define HAVE_MEMORY_H 1
# | #define HAVE_STRINGS_H 1
# | #define HAVE_INTTYPES_H 1
# | #define HAVE_STDINT_H 1
# | #define HAVE_UNISTD_H 1
# | #define __EXTENSIONS__ 1
# | #define _ALL_SOURCE 1
# | #define _GNU_SOURCE 1
# | #define _POSIX_PTHREAD_SEMANTICS 1
# | #define _TANDEM_SOURCE 1
# | #define HAVE_DLFCN_H 1
# | #define LT_OBJDIR ".libs/"
# | #define BUILD "x86_64-pc-linux-gnu"
# | #define HOST "x86_64-unknown-linux-gnu"
# | #define TARGET "x86_64-unknown-linux-gnu"
# | #define CA_BUNDLE "/etc/ssl/certs/ca-certificates.crt"
# | #define CXX11_OVERRIDE override
# | #define HAVE_ZLIB 1
# | #define HAVE_SQLITE3 1
# | #define HAVE_LIBGNUTLS 1
# | #define HAVE_LIBGCRYPT 1
# | #define HAVE_LIBSSH2 1
# | #define HAVE_LIBCARES 1
# | #define HAVE_ARES_ADDR_NODE 1
# | #define HAVE_ARES_SET_SERVERS 1
# | #define USE_LIBGCRYPT_MD 1
# | #define ENABLE_SSL 1
# | #define ENABLE_BITTORRENT 1
# | #define ENABLE_ASYNC_DNS 1
# | #define HAVE_ALLOCA_H 1
# | #define HAVE_ALLOCA 1
# | #define STDC_HEADERS 1
# | #define HAVE_ARPA_INET_H 1
# | #define HAVE_FCNTL_H 1
# | #define HAVE_FLOAT_H 1
# | #define HAVE_INTTYPES_H 1
# | #define HAVE_LANGINFO_H 1
# | #define HAVE_LIBINTL_H 1
# | #define HAVE_LIMITS_H 1
# | #define HAVE_LOCALE_H 1
# | #define HAVE_MALLOC_H 1
# | #define HAVE_NETDB_H 1
# | #define HAVE_NETINET_IN_H 1
# | #define HAVE_NETINET_TCP_H 1
# | #define HAVE_POLL_H 1
# | #define HAVE_SIGNAL_H 1
# | #define HAVE_STDDEF_H 1
# | #define HAVE_STDINT_H 1
# | #define HAVE_STDIO_EXT_H 1
# | #define HAVE_STDLIB_H 1
# | #define HAVE_STRING_H 1
# | #define HAVE_STRINGS_H 1
# | #define HAVE_SYS_IOCTL_H 1
# | #define HAVE_SYS_PARAM_H 1
# | #define HAVE_SYS_RESOURCE_H 1
# | #define HAVE_SYS_SIGNAL_H 1
# | #define HAVE_SYS_SOCKET_H 1
# | #define HAVE_SYS_TIME_H 1
# | #define HAVE_SYS_TYPES_H 1
# | #define HAVE_SYS_UIO_H 1
# | #define HAVE_SYS_UTSNAME_H 1
# | #define HAVE_TERMIOS_H 1
# | #define HAVE_UNISTD_H 1
# | #define HAVE_UTIME_H 1
# | #define HAVE_WCHAR_H 1
# | #define HAVE_IFADDRS_H 1
# | #define HAVE_PWD_H 1
# | #define HAVE_STDBOOL_H 1
# | #define TIME_WITH_SYS_TIME 1
# | #define HAVE_PTRDIFF_T 1
# | #define HAVE_A2_STRUCT_TIMESPEC 1
# | #define HAVE_ICONV 1
# | /* end confdefs.h. */
# | #include
# | int
# | main ()
# | {
# | error_at_line (0, 0, "", 0, "an error occurred");
# | ;
# | return 0;
# | }
# configure:24438: result: no
# configure:24450: checking whether clang needs -traditional
# conftest.cpp:88:10: fatal error: 'sgtty.h' file not found
# #include
# ^
# 1 error generated.
# conftest.cpp:88:10: fatal error: 'termio.h' file not found
# #include
# ^
# 1 error generated.
# configure:24484: result: no
# configure:24492: checking for working memcmp
# configure:24535: clang++ -o conftest conftest.cpp >&5
# configure:24535: $? = 0
# configure:24535: ./conftest
# configure:24535: $? = 0
# configure:24545: result: yes
# configure:24560: checking for sys/time.h
# configure:24560: result: yes
# configure:24560: checking for unistd.h
# configure:24560: result: yes
# configure:24581: checking for alarm
# configure:24581: clang++ -o conftest conftest.cpp >&5
# configure:24581: $? = 0
# configure:24581: result: yes
# configure:24594: checking for working mktime
# configure:24796: clang++ -o conftest conftest.cpp >&5
# configure:24796: $? = 0
# configure:24796: ./conftest
# configure:24796: $? = 0
# configure:24806: result: yes
# configure:24820: checking sys/select.h usability
# configure:24820: clang++ -c conftest.cpp >&5
# configure:24820: $? = 0
# configure:24820: result: yes
# configure:24820: checking sys/select.h presence
# configure:24820: clang++ -E conftest.cpp
# configure:24820: $? = 0
# configure:24820: result: yes
# configure:24820: checking for sys/select.h
# configure:24820: result: yes
# configure:24820: checking for sys/socket.h
# configure:24820: result: yes
# configure:24830: checking types of arguments for select
# configure:24858: clang++ -c conftest.cpp >&5
# configure:24858: $? = 0
# configure:24869: result: int,fd_set *,struct timeval *
# configure:24892: checking whether lstat correctly handles trailing slash
# configure:24918: clang++ -o conftest conftest.cpp >&5
# configure:24918: $? = 0
# configure:24918: ./conftest
# configure:24918: $? = 0
# configure:24935: result: yes
# configure:24954: checking whether stat accepts an empty string
# configure:24974: clang++ -o conftest conftest.cpp >&5
# configure:24974: $? = 0
# configure:24974: ./conftest
# configure:24974: $? = 0
# configure:24984: result: no
# configure:25002: checking for strftime
# configure:25002: clang++ -o conftest conftest.cpp >&5
# configure:25002: $? = 0
# configure:25002: result: yes
# configure:25057: checking for vprintf
# configure:25057: clang++ -o conftest conftest.cpp >&5
# configure:25057: $? = 0
# configure:25057: result: yes
# configure:25063: checking for _doprnt
# configure:25063: clang++ -o conftest conftest.cpp >&5
# /tmp/conftest-1211bb.o:conftest.cpp:function main: error: undefined reference to '_doprnt'
# clang-3.8: error: linker command failed with exit code 1 (use -v to see invocation)
# configure:25063: $? = 1
# configure: failed program was:
# | /* confdefs.h */
# | #define PACKAGE_NAME "aria2"
# | #define PACKAGE_TARNAME "aria2"
# | #define PACKAGE_VERSION "1.24.0"
# | #define PACKAGE_STRING "aria2 1.24.0"
# | #define PACKAGE_BUGREPORT "https://github.com/aria2/aria2/issues"
# | #define PACKAGE_URL "https://aria2.github.io/"
# | #define PACKAGE "aria2"
# | #define VERSION "1.24.0"
# | #define STDC_HEADERS 1
# | #define HAVE_SYS_TYPES_H 1
# | #define HAVE_SYS_STAT_H 1
# | #define HAVE_STDLIB_H 1
# | #define HAVE_STRING_H 1
# | #define HAVE_MEMORY_H 1
# | #define HAVE_STRINGS_H 1
# | #define HAVE_INTTYPES_H 1
# | #define HAVE_STDINT_H 1
# | #define HAVE_UNISTD_H 1
# | #define __EXTENSIONS__ 1
# | #define _ALL_SOURCE 1
# | #define _GNU_SOURCE 1
# | #define _POSIX_PTHREAD_SEMANTICS 1
# | #define _TANDEM_SOURCE 1
# | #define HAVE_DLFCN_H 1
# | #define LT_OBJDIR ".libs/"
# | #define BUILD "x86_64-pc-linux-gnu"
# | #define HOST "x86_64-unknown-linux-gnu"
# | #define TARGET "x86_64-unknown-linux-gnu"
# | #define CA_BUNDLE "/etc/ssl/certs/ca-certificates.crt"
# | #define CXX11_OVERRIDE override
# | #define HAVE_ZLIB 1
# | #define HAVE_SQLITE3 1
# | #define HAVE_LIBGNUTLS 1
# | #define HAVE_LIBGCRYPT 1
# | #define HAVE_LIBSSH2 1
# | #define HAVE_LIBCARES 1
# | #define HAVE_ARES_ADDR_NODE 1
# | #define HAVE_ARES_SET_SERVERS 1
# | #define USE_LIBGCRYPT_MD 1
# | #define ENABLE_SSL 1
# | #define ENABLE_BITTORRENT 1
# | #define ENABLE_ASYNC_DNS 1
# | #define HAVE_ALLOCA_H 1
# | #define HAVE_ALLOCA 1
# | #define STDC_HEADERS 1
# | #define HAVE_ARPA_INET_H 1
# | #define HAVE_FCNTL_H 1
# | #define HAVE_FLOAT_H 1
# | #define HAVE_INTTYPES_H 1
# | #define HAVE_LANGINFO_H 1
# | #define HAVE_LIBINTL_H 1
# | #define HAVE_LIMITS_H 1
# | #define HAVE_LOCALE_H 1
# | #define HAVE_MALLOC_H 1
# | #define HAVE_NETDB_H 1
# | #define HAVE_NETINET_IN_H 1
# | #define HAVE_NETINET_TCP_H 1
# | #define HAVE_POLL_H 1
# | #define HAVE_SIGNAL_H 1
# | #define HAVE_STDDEF_H 1
# | #define HAVE_STDINT_H 1
# | #define HAVE_STDIO_EXT_H 1
# | #define HAVE_STDLIB_H 1
# | #define HAVE_STRING_H 1
# | #define HAVE_STRINGS_H 1
# | #define HAVE_SYS_IOCTL_H 1
# | #define HAVE_SYS_PARAM_H 1
# | #define HAVE_SYS_RESOURCE_H 1
# | #define HAVE_SYS_SIGNAL_H 1
# | #define HAVE_SYS_SOCKET_H 1
# | #define HAVE_SYS_TIME_H 1
# | #define HAVE_SYS_TYPES_H 1
# | #define HAVE_SYS_UIO_H 1
# | #define HAVE_SYS_UTSNAME_H 1
# | #define HAVE_TERMIOS_H 1
# | #define HAVE_UNISTD_H 1
# | #define HAVE_UTIME_H 1
# | #define HAVE_WCHAR_H 1
# | #define HAVE_IFADDRS_H 1
# | #define HAVE_PWD_H 1
# | #define HAVE_STDBOOL_H 1
# | #define TIME_WITH_SYS_TIME 1
# | #define HAVE_PTRDIFF_T 1
# | #define HAVE_A2_STRUCT_TIMESPEC 1
# | #define HAVE_ICONV 1
# | #define HAVE_SYS_TIME_H 1
# | #define HAVE_UNISTD_H 1
# | #define HAVE_ALARM 1
# | #define HAVE_SYS_SELECT_H 1
# | #define HAVE_SYS_SOCKET_H 1
# | #define SELECT_TYPE_ARG1 int
# | #define SELECT_TYPE_ARG234 (fd_set *)
# | #define SELECT_TYPE_ARG5 (struct timeval *)
# | #define LSTAT_FOLLOWS_SLASHED_SYMLINK 1
# | #define HAVE_STRFTIME 1
# | #define HAVE_VPRINTF 1
# | /* end confdefs.h. */
# | /* Define _doprnt to an innocuous variant, in case declares _doprnt.
# | For example, HP-UX 11i declares gettimeofday. */
# | #define _doprnt innocuous__doprnt
# |
# | /* System header to define __stub macros and hopefully few prototypes,
# | which can conflict with char _doprnt (); below.
# | Prefer to if __STDC__ is defined, since
# | exists even on freestanding compilers. */
# |
# | #ifdef __STDC__
# | # include
# | #else
# | # include
# | #endif
# |
# | #undef _doprnt
# |
# | /* Override any GCC internal prototype to avoid an error.
# | Use char because int might match the return type of a GCC
# | builtin and then its argument prototype would still apply. */
# | #ifdef __cplusplus
# | extern "C"
# | #endif
# | char _doprnt ();
# | /* The GNU C library defines this for functions which it implements
# | to always fail with ENOSYS. Some functions are actually named
# | something starting with __ and the normal name is an alias. */
# | #if defined __stub__doprnt || defined __stub____doprnt
# | choke me
# | #endif
# |
# | int
# | main ()
# | {
# | return _doprnt ();
# | ;
# | return 0;
# | }
# configure:25063: result: no
# configure:25076: checking vfork.h usability
# configure:25076: clang++ -c conftest.cpp >&5
# conftest.cpp:132:10: fatal error: 'vfork.h' file not found
# #include
# ^
# 1 error generated.
# configure:25076: $? = 1
# configure: failed program was:
# | /* confdefs.h */
# | #define PACKAGE_NAME "aria2"
# | #define PACKAGE_TARNAME "aria2"
# | #define PACKAGE_VERSION "1.24.0"
# | #define PACKAGE_STRING "aria2 1.24.0"
# | #define PACKAGE_BUGREPORT "https://github.com/aria2/aria2/issues"
# | #define PACKAGE_URL "https://aria2.github.io/"
# | #define PACKAGE "aria2"
# | #define VERSION "1.24.0"
# | #define STDC_HEADERS 1
# | #define HAVE_SYS_TYPES_H 1
# | #define HAVE_SYS_STAT_H 1
# | #define HAVE_STDLIB_H 1
# | #define HAVE_STRING_H 1
# | #define HAVE_MEMORY_H 1
# | #define HAVE_STRINGS_H 1
# | #define HAVE_INTTYPES_H 1
# | #define HAVE_STDINT_H 1
# | #define HAVE_UNISTD_H 1
# | #define __EXTENSIONS__ 1
# | #define _ALL_SOURCE 1
# | #define _GNU_SOURCE 1
# | #define _POSIX_PTHREAD_SEMANTICS 1
# | #define _TANDEM_SOURCE 1
# | #define HAVE_DLFCN_H 1
# | #define LT_OBJDIR ".libs/"
# | #define BUILD "x86_64-pc-linux-gnu"
# | #define HOST "x86_64-unknown-linux-gnu"
# | #define TARGET "x86_64-unknown-linux-gnu"
# | #define CA_BUNDLE "/etc/ssl/certs/ca-certificates.crt"
# | #define CXX11_OVERRIDE override
# | #define HAVE_ZLIB 1
# | #define HAVE_SQLITE3 1
# | #define HAVE_LIBGNUTLS 1
# | #define HAVE_LIBGCRYPT 1
# | #define HAVE_LIBSSH2 1
# | #define HAVE_LIBCARES 1
# | #define HAVE_ARES_ADDR_NODE 1
# | #define HAVE_ARES_SET_SERVERS 1
# | #define USE_LIBGCRYPT_MD 1
# | #define ENABLE_SSL 1
# | #define ENABLE_BITTORRENT 1
# | #define ENABLE_ASYNC_DNS 1
# | #define HAVE_ALLOCA_H 1
# | #define HAVE_ALLOCA 1
# | #define STDC_HEADERS 1
# | #define HAVE_ARPA_INET_H 1
# | #define HAVE_FCNTL_H 1
# | #define HAVE_FLOAT_H 1
# | #define HAVE_INTTYPES_H 1
# | #define HAVE_LANGINFO_H 1
# | #define HAVE_LIBINTL_H 1
# | #define HAVE_LIMITS_H 1
# | #define HAVE_LOCALE_H 1
# | #define HAVE_MALLOC_H 1
# | #define HAVE_NETDB_H 1
# | #define HAVE_NETINET_IN_H 1
# | #define HAVE_NETINET_TCP_H 1
# | #define HAVE_POLL_H 1
# | #define HAVE_SIGNAL_H 1
# | #define HAVE_STDDEF_H 1
# | #define HAVE_STDINT_H 1
# | #define HAVE_STDIO_EXT_H 1
# | #define HAVE_STDLIB_H 1
# | #define HAVE_STRING_H 1
# | #define HAVE_STRINGS_H 1
# | #define HAVE_SYS_IOCTL_H 1
# | #define HAVE_SYS_PARAM_H 1
# | #define HAVE_SYS_RESOURCE_H 1
# | #define HAVE_SYS_SIGNAL_H 1
# | #define HAVE_SYS_SOCKET_H 1
# | #define HAVE_SYS_TIME_H 1
# | #define HAVE_SYS_TYPES_H 1
# | #define HAVE_SYS_UIO_H 1
# | #define HAVE_SYS_UTSNAME_H 1
# | #define HAVE_TERMIOS_H 1
# | #define HAVE_UNISTD_H 1
# | #define HAVE_UTIME_H 1
# | #define HAVE_WCHAR_H 1
# | #define HAVE_IFADDRS_H 1
# | #define HAVE_PWD_H 1
# | #define HAVE_STDBOOL_H 1
# | #define TIME_WITH_SYS_TIME 1
# | #define HAVE_PTRDIFF_T 1
# | #define HAVE_A2_STRUCT_TIMESPEC 1
# | #define HAVE_ICONV 1
# | #define HAVE_SYS_TIME_H 1
# | #define HAVE_UNISTD_H 1
# | #define HAVE_ALARM 1
# | #define HAVE_SYS_SELECT_H 1
# | #define HAVE_SYS_SOCKET_H 1
# | #define SELECT_TYPE_ARG1 int
# | #define SELECT_TYPE_ARG234 (fd_set *)
# | #define SELECT_TYPE_ARG5 (struct timeval *)
# | #define LSTAT_FOLLOWS_SLASHED_SYMLINK 1
# | #define HAVE_STRFTIME 1
# | #define HAVE_VPRINTF 1
# | /* end confdefs.h. */
# | #include
# | #ifdef HAVE_SYS_TYPES_H
# | # include
# | #endif
# | #ifdef HAVE_SYS_STAT_H
# | # include
# | #endif
# | #ifdef STDC_HEADERS
# | # include
# | # include
# | #else
# | # ifdef HAVE_STDLIB_H
# | # include
# | # endif
# | #endif
# | #ifdef HAVE_STRING_H
# | # if !defined STDC_HEADERS && defined HAVE_MEMORY_H
# | # include
# | # endif
# | # include
# | #endif
# | #ifdef HAVE_STRINGS_H
# | # include
# | #endif
# | #ifdef HAVE_INTTYPES_H
# | # include
# | #endif
# | #ifdef HAVE_STDINT_H
# | # include
# | #endif
# | #ifdef HAVE_UNISTD_H
# | # include
# | #endif
# | #include
# configure:25076: result: no
# configure:25076: checking vfork.h presence
# configure:25076: clang++ -E conftest.cpp
# conftest.cpp:99:10: fatal error: 'vfork.h' file not found
# #include
# ^
# 1 error generated.
# configure:25076: $? = 1
# configure: failed program was:
# | /* confdefs.h */
# | #define PACKAGE_NAME "aria2"
# | #define PACKAGE_TARNAME "aria2"
# | #define PACKAGE_VERSION "1.24.0"
# | #define PACKAGE_STRING "aria2 1.24.0"
# | #define PACKAGE_BUGREPORT "https://github.com/aria2/aria2/issues"
# | #define PACKAGE_URL "https://aria2.github.io/"
# | #define PACKAGE "aria2"
# | #define VERSION "1.24.0"
# | #define STDC_HEADERS 1
# | #define HAVE_SYS_TYPES_H 1
# | #define HAVE_SYS_STAT_H 1
# | #define HAVE_STDLIB_H 1
# | #define HAVE_STRING_H 1
# | #define HAVE_MEMORY_H 1
# | #define HAVE_STRINGS_H 1
# | #define HAVE_INTTYPES_H 1
# | #define HAVE_STDINT_H 1
# | #define HAVE_UNISTD_H 1
# | #define __EXTENSIONS__ 1
# | #define _ALL_SOURCE 1
# | #define _GNU_SOURCE 1
# | #define _POSIX_PTHREAD_SEMANTICS 1
# | #define _TANDEM_SOURCE 1
# | #define HAVE_DLFCN_H 1
# | #define LT_OBJDIR ".libs/"
# | #define BUILD "x86_64-pc-linux-gnu"
# | #define HOST "x86_64-unknown-linux-gnu"
# | #define TARGET "x86_64-unknown-linux-gnu"
# | #define CA_BUNDLE "/etc/ssl/certs/ca-certificates.crt"
# | #define CXX11_OVERRIDE override
# | #define HAVE_ZLIB 1
# | #define HAVE_SQLITE3 1
# | #define HAVE_LIBGNUTLS 1
# | #define HAVE_LIBGCRYPT 1
# | #define HAVE_LIBSSH2 1
# | #define HAVE_LIBCARES 1
# | #define HAVE_ARES_ADDR_NODE 1
# | #define HAVE_ARES_SET_SERVERS 1
# | #define USE_LIBGCRYPT_MD 1
# | #define ENABLE_SSL 1
# | #define ENABLE_BITTORRENT 1
# | #define ENABLE_ASYNC_DNS 1
# | #define HAVE_ALLOCA_H 1
# | #define HAVE_ALLOCA 1
# | #define STDC_HEADERS 1
# | #define HAVE_ARPA_INET_H 1
# | #define HAVE_FCNTL_H 1
# | #define HAVE_FLOAT_H 1
# | #define HAVE_INTTYPES_H 1
# | #define HAVE_LANGINFO_H 1
# | #define HAVE_LIBINTL_H 1
# | #define HAVE_LIMITS_H 1
# | #define HAVE_LOCALE_H 1
# | #define HAVE_MALLOC_H 1
# | #define HAVE_NETDB_H 1
# | #define HAVE_NETINET_IN_H 1
# | #define HAVE_NETINET_TCP_H 1
# | #define HAVE_POLL_H 1
# | #define HAVE_SIGNAL_H 1
# | #define HAVE_STDDEF_H 1
# | #define HAVE_STDINT_H 1
# | #define HAVE_STDIO_EXT_H 1
# | #define HAVE_STDLIB_H 1
# | #define HAVE_STRING_H 1
# | #define HAVE_STRINGS_H 1
# | #define HAVE_SYS_IOCTL_H 1
# | #define HAVE_SYS_PARAM_H 1
# | #define HAVE_SYS_RESOURCE_H 1
# | #define HAVE_SYS_SIGNAL_H 1
# | #define HAVE_SYS_SOCKET_H 1
# | #define HAVE_SYS_TIME_H 1
# | #define HAVE_SYS_TYPES_H 1
# | #define HAVE_SYS_UIO_H 1
# | #define HAVE_SYS_UTSNAME_H 1
# | #define HAVE_TERMIOS_H 1
# | #define HAVE_UNISTD_H 1
# | #define HAVE_UTIME_H 1
# | #define HAVE_WCHAR_H 1
# | #define HAVE_IFADDRS_H 1
# | #define HAVE_PWD_H 1
# | #define HAVE_STDBOOL_H 1
# | #define TIME_WITH_SYS_TIME 1
# | #define HAVE_PTRDIFF_T 1
# | #define HAVE_A2_STRUCT_TIMESPEC 1
# | #define HAVE_ICONV 1
# | #define HAVE_SYS_TIME_H 1
# | #define HAVE_UNISTD_H 1
# | #define HAVE_ALARM 1
# | #define HAVE_SYS_SELECT_H 1
# | #define HAVE_SYS_SOCKET_H 1
# | #define SELECT_TYPE_ARG1 int
# | #define SELECT_TYPE_ARG234 (fd_set *)
# | #define SELECT_TYPE_ARG5 (struct timeval *)
# | #define LSTAT_FOLLOWS_SLASHED_SYMLINK 1
# | #define HAVE_STRFTIME 1
# | #define HAVE_VPRINTF 1
# | /* end confdefs.h. */
# | #include
# configure:25076: result: no
# configure:25076: checking for vfork.h
# configure:25076: result: no
# configure:25089: checking for fork
# configure:25089: clang++ -o conftest conftest.cpp >&5
# configure:25089: $? = 0
# configure:25089: result: yes
# configure:25089: checking for vfork
# configure:25089: clang++ -o conftest conftest.cpp >&5
# configure:25089: $? = 0
# configure:25089: result: yes
# configure:25099: checking for working fork
# configure:25121: clang++ -o conftest conftest.cpp >&5
# configure:25121: $? = 0
# configure:25121: ./conftest
# configure:25121: $? = 0
# configure:25131: result: yes
# configure:25152: checking for working vfork
# configure:25262: result: yes
# configure:25287: checking for working strtod
# configure:25328: clang++ -o conftest conftest.cpp >&5
# conftest.cpp:145:20: warning: conversion from string literal to 'char *' is deprecated [-Wc++11-compat-deprecated-writable-strings]
# char *string = " +69";
# ^
# conftest.cpp:156:20: warning: conversion from string literal to 'char *' is deprecated [-Wc++11-compat-deprecated-writable-strings]
# char *string = "NaN";
# ^
# 2 warnings generated.
# configure:25328: $? = 0
# configure:25328: ./conftest
# configure:25328: $? = 0
# configure:25338: result: yes
# configure:25450: checking for __argz_count
# configure:25450: clang++ -o conftest conftest.cpp >&5
# /tmp/conftest-f83b38.o:conftest.cpp:function main: error: undefined reference to '__argz_count'
# clang-3.8: error: linker command failed with exit code 1 (use -v to see invocation)
# configure:25450: $? = 1
# configure: failed program was:
# | /* confdefs.h */
# | #define PACKAGE_NAME "aria2"
# | #define PACKAGE_TARNAME "aria2"
# | #define PACKAGE_VERSION "1.24.0"
# | #define PACKAGE_STRING "aria2 1.24.0"
# | #define PACKAGE_BUGREPORT "https://github.com/aria2/aria2/issues"
# | #define PACKAGE_URL "https://aria2.github.io/"
# | #define PACKAGE "aria2"
# | #define VERSION "1.24.0"
# | #define STDC_HEADERS 1
# | #define HAVE_SYS_TYPES_H 1
# | #define HAVE_SYS_STAT_H 1
# | #define HAVE_STDLIB_H 1
# | #define HAVE_STRING_H 1
# | #define HAVE_MEMORY_H 1
# | #define HAVE_STRINGS_H 1
# | #define HAVE_INTTYPES_H 1
# | #define HAVE_STDINT_H 1
# | #define HAVE_UNISTD_H 1
# | #define __EXTENSIONS__ 1
# | #define _ALL_SOURCE 1
# | #define _GNU_SOURCE 1
# | #define _POSIX_PTHREAD_SEMANTICS 1
# | #define _TANDEM_SOURCE 1
# | #define HAVE_DLFCN_H 1
# | #define LT_OBJDIR ".libs/"
# | #define BUILD "x86_64-pc-linux-gnu"
# | #define HOST "x86_64-unknown-linux-gnu"
# | #define TARGET "x86_64-unknown-linux-gnu"
# | #define CA_BUNDLE "/etc/ssl/certs/ca-certificates.crt"
# | #define CXX11_OVERRIDE override
# | #define HAVE_ZLIB 1
# | #define HAVE_SQLITE3 1
# | #define HAVE_LIBGNUTLS 1
# | #define HAVE_LIBGCRYPT 1
# | #define HAVE_LIBSSH2 1
# | #define HAVE_LIBCARES 1
# | #define HAVE_ARES_ADDR_NODE 1
# | #define HAVE_ARES_SET_SERVERS 1
# | #define USE_LIBGCRYPT_MD 1
# | #define ENABLE_SSL 1
# | #define ENABLE_BITTORRENT 1
# | #define ENABLE_ASYNC_DNS 1
# | #define HAVE_ALLOCA_H 1
# | #define HAVE_ALLOCA 1
# | #define STDC_HEADERS 1
# | #define HAVE_ARPA_INET_H 1
# | #define HAVE_FCNTL_H 1
# | #define HAVE_FLOAT_H 1
# | #define HAVE_INTTYPES_H 1
# | #define HAVE_LANGINFO_H 1
# | #define HAVE_LIBINTL_H 1
# | #define HAVE_LIMITS_H 1
# | #define HAVE_LOCALE_H 1
# | #define HAVE_MALLOC_H 1
# | #define HAVE_NETDB_H 1
# | #define HAVE_NETINET_IN_H 1
# | #define HAVE_NETINET_TCP_H 1
# | #define HAVE_POLL_H 1
# | #define HAVE_SIGNAL_H 1
# | #define HAVE_STDDEF_H 1
# | #define HAVE_STDINT_H 1
# | #define HAVE_STDIO_EXT_H 1
# | #define HAVE_STDLIB_H 1
# | #define HAVE_STRING_H 1
# | #define HAVE_STRINGS_H 1
# | #define HAVE_SYS_IOCTL_H 1
# | #define HAVE_SYS_PARAM_H 1
# | #define HAVE_SYS_RESOURCE_H 1
# | #define HAVE_SYS_SIGNAL_H 1
# | #define HAVE_SYS_SOCKET_H 1
# | #define HAVE_SYS_TIME_H 1
# | #define HAVE_SYS_TYPES_H 1
# | #define HAVE_SYS_UIO_H 1
# | #define HAVE_SYS_UTSNAME_H 1
# | #define HAVE_TERMIOS_H 1
# | #define HAVE_UNISTD_H 1
# | #define HAVE_UTIME_H 1
# | #define HAVE_WCHAR_H 1
# | #define HAVE_IFADDRS_H 1
# | #define HAVE_PWD_H 1
# | #define HAVE_STDBOOL_H 1
# | #define TIME_WITH_SYS_TIME 1
# | #define HAVE_PTRDIFF_T 1
# | #define HAVE_A2_STRUCT_TIMESPEC 1
# | #define HAVE_ICONV 1
# | #define HAVE_SYS_TIME_H 1
# | #define HAVE_UNISTD_H 1
# | #define HAVE_ALARM 1
# | #define HAVE_SYS_SELECT_H 1
# | #define HAVE_SYS_SOCKET_H 1
# | #define SELECT_TYPE_ARG1 int
# | #define SELECT_TYPE_ARG234 (fd_set *)
# | #define SELECT_TYPE_ARG5 (struct timeval *)
# | #define LSTAT_FOLLOWS_SLASHED_SYMLINK 1
# | #define HAVE_STRFTIME 1
# | #define HAVE_VPRINTF 1
# | #define HAVE_FORK 1
# | #define HAVE_VFORK 1
# | #define HAVE_WORKING_VFORK 1
# | #define HAVE_WORKING_FORK 1
# | /* end confdefs.h. */
# | /* Define __argz_count to an innocuous variant, in case declares __argz_count.
# | For example, HP-UX 11i declares gettimeofday. */
# | #define __argz_count innocuous___argz_count
# |
# | /* System header to define __stub macros and hopefully few prototypes,
# | which can conflict with char __argz_count (); below.
# | Prefer to if __STDC__ is defined, since
# | exists even on freestanding compilers. */
# |
# | #ifdef __STDC__
# | # include
# | #else
# | # include
# | #endif
# |
# | #undef __argz_count
# |
# | /* Override any GCC internal prototype to avoid an error.
# | Use char because int might match the return type of a GCC
# | builtin and then its argument prototype would still apply. */
# | #ifdef __cplusplus
# | extern "C"
# | #endif
# | char __argz_count ();
# | /* The GNU C library defines this for functions which it implements
# | to always fail with ENOSYS. Some functions are actually named
# | something starting with __ and the normal name is an alias. */
# | #if defined __stub___argz_count || defined __stub_____argz_count
# | choke me
# | #endif
# |
# | int
# | main ()
# | {
# | return __argz_count ();
# | ;
# | return 0;
# | }
# configure:25450: result: no
# configure:25450: checking for __argz_next
# configure:25450: clang++ -o conftest conftest.cpp >&5
# /tmp/conftest-1c89a6.o:conftest.cpp:function main: error: undefined reference to '__argz_next'
# clang-3.8: error: linker command failed with exit code 1 (use -v to see invocation)
# configure:25450: $? = 1
# configure: failed program was:
# | /* confdefs.h */
# | #define PACKAGE_NAME "aria2"
# | #define PACKAGE_TARNAME "aria2"
# | #define PACKAGE_VERSION "1.24.0"
# | #define PACKAGE_STRING "aria2 1.24.0"
# | #define PACKAGE_BUGREPORT "https://github.com/aria2/aria2/issues"
# | #define PACKAGE_URL "https://aria2.github.io/"
# | #define PACKAGE "aria2"
# | #define VERSION "1.24.0"
# | #define STDC_HEADERS 1
# | #define HAVE_SYS_TYPES_H 1
# | #define HAVE_SYS_STAT_H 1
# | #define HAVE_STDLIB_H 1
# | #define HAVE_STRING_H 1
# | #define HAVE_MEMORY_H 1
# | #define HAVE_STRINGS_H 1
# | #define HAVE_INTTYPES_H 1
# | #define HAVE_STDINT_H 1
# | #define HAVE_UNISTD_H 1
# | #define __EXTENSIONS__ 1
# | #define _ALL_SOURCE 1
# | #define _GNU_SOURCE 1
# | #define _POSIX_PTHREAD_SEMANTICS 1
# | #define _TANDEM_SOURCE 1
# | #define HAVE_DLFCN_H 1
# | #define LT_OBJDIR ".libs/"
# | #define BUILD "x86_64-pc-linux-gnu"
# | #define HOST "x86_64-unknown-linux-gnu"
# | #define TARGET "x86_64-unknown-linux-gnu"
# | #define CA_BUNDLE "/etc/ssl/certs/ca-certificates.crt"
# | #define CXX11_OVERRIDE override
# | #define HAVE_ZLIB 1
# | #define HAVE_SQLITE3 1
# | #define HAVE_LIBGNUTLS 1
# | #define HAVE_LIBGCRYPT 1
# | #define HAVE_LIBSSH2 1
# | #define HAVE_LIBCARES 1
# | #define HAVE_ARES_ADDR_NODE 1
# | #define HAVE_ARES_SET_SERVERS 1
# | #define USE_LIBGCRYPT_MD 1
# | #define ENABLE_SSL 1
# | #define ENABLE_BITTORRENT 1
# | #define ENABLE_ASYNC_DNS 1
# | #define HAVE_ALLOCA_H 1
# | #define HAVE_ALLOCA 1
# | #define STDC_HEADERS 1
# | #define HAVE_ARPA_INET_H 1
# | #define HAVE_FCNTL_H 1
# | #define HAVE_FLOAT_H 1
# | #define HAVE_INTTYPES_H 1
# | #define HAVE_LANGINFO_H 1
# | #define HAVE_LIBINTL_H 1
# | #define HAVE_LIMITS_H 1
# | #define HAVE_LOCALE_H 1
# | #define HAVE_MALLOC_H 1
# | #define HAVE_NETDB_H 1
# | #define HAVE_NETINET_IN_H 1
# | #define HAVE_NETINET_TCP_H 1
# | #define HAVE_POLL_H 1
# | #define HAVE_SIGNAL_H 1
# | #define HAVE_STDDEF_H 1
# | #define HAVE_STDINT_H 1
# | #define HAVE_STDIO_EXT_H 1
# | #define HAVE_STDLIB_H 1
# | #define HAVE_STRING_H 1
# | #define HAVE_STRINGS_H 1
# | #define HAVE_SYS_IOCTL_H 1
# | #define HAVE_SYS_PARAM_H 1
# | #define HAVE_SYS_RESOURCE_H 1
# | #define HAVE_SYS_SIGNAL_H 1
# | #define HAVE_SYS_SOCKET_H 1
# | #define HAVE_SYS_TIME_H 1
# | #define HAVE_SYS_TYPES_H 1
# | #define HAVE_SYS_UIO_H 1
# | #define HAVE_SYS_UTSNAME_H 1
# | #define HAVE_TERMIOS_H 1
# | #define HAVE_UNISTD_H 1
# | #define HAVE_UTIME_H 1
# | #define HAVE_WCHAR_H 1
# | #define HAVE_IFADDRS_H 1
# | #define HAVE_PWD_H 1
# | #define HAVE_STDBOOL_H 1
# | #define TIME_WITH_SYS_TIME 1
# | #define HAVE_PTRDIFF_T 1
# | #define HAVE_A2_STRUCT_TIMESPEC 1
# | #define HAVE_ICONV 1
# | #define HAVE_SYS_TIME_H 1
# | #define HAVE_UNISTD_H 1
# | #define HAVE_ALARM 1
# | #define HAVE_SYS_SELECT_H 1
# | #define HAVE_SYS_SOCKET_H 1
# | #define SELECT_TYPE_ARG1 int
# | #define SELECT_TYPE_ARG234 (fd_set *)
# | #define SELECT_TYPE_ARG5 (struct timeval *)
# | #define LSTAT_FOLLOWS_SLASHED_SYMLINK 1
# | #define HAVE_STRFTIME 1
# | #define HAVE_VPRINTF 1
# | #define HAVE_FORK 1
# | #define HAVE_VFORK 1
# | #define HAVE_WORKING_VFORK 1
# | #define HAVE_WORKING_FORK 1
# | /* end confdefs.h. */
# | /* Define __argz_next to an innocuous variant, in case declares __argz_next.
# | For example, HP-UX 11i declares gettimeofday. */
# | #define __argz_next innocuous___argz_next
# |
# | /* System header to define __stub macros and hopefully few prototypes,
# | which can conflict with char __argz_next (); below.
# | Prefer to if __STDC__ is defined, since
# | exists even on freestanding compilers. */
# |
# | #ifdef __STDC__
# | # include
# | #else
# | # include
# | #endif
# |
# | #undef __argz_next
# |
# | /* Override any GCC internal prototype to avoid an error.
# | Use char because int might match the return type of a GCC
# | builtin and then its argument prototype would still apply. */
# | #ifdef __cplusplus
# | extern "C"
# | #endif
# | char __argz_next ();
# | /* The GNU C library defines this for functions which it implements
# | to always fail with ENOSYS. Some functions are actually named
# | something starting with __ and the normal name is an alias. */
# | #if defined __stub___argz_next || defined __stub_____argz_next
# | choke me
# | #endif
# |
# | int
# | main ()
# | {
# | return __argz_next ();
# | ;
# | return 0;
# | }
# configure:25450: result: no
# configure:25450: checking for __argz_stringify
# configure:25450: clang++ -o conftest conftest.cpp >&5
# /tmp/conftest-fde5ba.o:conftest.cpp:function main: error: undefined reference to '__argz_stringify'
# clang-3.8: error: linker command failed with exit code 1 (use -v to see invocation)
# configure:25450: $? = 1
# configure: failed program was:
# | /* confdefs.h */
# | #define PACKAGE_NAME "aria2"
# | #define PACKAGE_TARNAME "aria2"
# | #define PACKAGE_VERSION "1.24.0"
# | #define PACKAGE_STRING "aria2 1.24.0"
# | #define PACKAGE_BUGREPORT "https://github.com/aria2/aria2/issues"
# | #define PACKAGE_URL "https://aria2.github.io/"
# | #define PACKAGE "aria2"
# | #define VERSION "1.24.0"
# | #define STDC_HEADERS 1
# | #define HAVE_SYS_TYPES_H 1
# | #define HAVE_SYS_STAT_H 1
# | #define HAVE_STDLIB_H 1
# | #define HAVE_STRING_H 1
# | #define HAVE_MEMORY_H 1
# | #define HAVE_STRINGS_H 1
# | #define HAVE_INTTYPES_H 1
# | #define HAVE_STDINT_H 1
# | #define HAVE_UNISTD_H 1
# | #define __EXTENSIONS__ 1
# | #define _ALL_SOURCE 1
# | #define _GNU_SOURCE 1
# | #define _POSIX_PTHREAD_SEMANTICS 1
# | #define _TANDEM_SOURCE 1
# | #define HAVE_DLFCN_H 1
# | #define LT_OBJDIR ".libs/"
# | #define BUILD "x86_64-pc-linux-gnu"
# | #define HOST "x86_64-unknown-linux-gnu"
# | #define TARGET "x86_64-unknown-linux-gnu"
# | #define CA_BUNDLE "/etc/ssl/certs/ca-certificates.crt"
# | #define CXX11_OVERRIDE override
# | #define HAVE_ZLIB 1
# | #define HAVE_SQLITE3 1
# | #define HAVE_LIBGNUTLS 1
# | #define HAVE_LIBGCRYPT 1
# | #define HAVE_LIBSSH2 1
# | #define HAVE_LIBCARES 1
# | #define HAVE_ARES_ADDR_NODE 1
# | #define HAVE_ARES_SET_SERVERS 1
# | #define USE_LIBGCRYPT_MD 1
# | #define ENABLE_SSL 1
# | #define ENABLE_BITTORRENT 1
# | #define ENABLE_ASYNC_DNS 1
# | #define HAVE_ALLOCA_H 1
# | #define HAVE_ALLOCA 1
# | #define STDC_HEADERS 1
# | #define HAVE_ARPA_INET_H 1
# | #define HAVE_FCNTL_H 1
# | #define HAVE_FLOAT_H 1
# | #define HAVE_INTTYPES_H 1
# | #define HAVE_LANGINFO_H 1
# | #define HAVE_LIBINTL_H 1
# | #define HAVE_LIMITS_H 1
# | #define HAVE_LOCALE_H 1
# | #define HAVE_MALLOC_H 1
# | #define HAVE_NETDB_H 1
# | #define HAVE_NETINET_IN_H 1
# | #define HAVE_NETINET_TCP_H 1
# | #define HAVE_POLL_H 1
# | #define HAVE_SIGNAL_H 1
# | #define HAVE_STDDEF_H 1
# | #define HAVE_STDINT_H 1
# | #define HAVE_STDIO_EXT_H 1
# | #define HAVE_STDLIB_H 1
# | #define HAVE_STRING_H 1
# | #define HAVE_STRINGS_H 1
# | #define HAVE_SYS_IOCTL_H 1
# | #define HAVE_SYS_PARAM_H 1
# | #define HAVE_SYS_RESOURCE_H 1
# | #define HAVE_SYS_SIGNAL_H 1
# | #define HAVE_SYS_SOCKET_H 1
# | #define HAVE_SYS_TIME_H 1
# | #define HAVE_SYS_TYPES_H 1
# | #define HAVE_SYS_UIO_H 1
# | #define HAVE_SYS_UTSNAME_H 1
# | #define HAVE_TERMIOS_H 1
# | #define HAVE_UNISTD_H 1
# | #define HAVE_UTIME_H 1
# | #define HAVE_WCHAR_H 1
# | #define HAVE_IFADDRS_H 1
# | #define HAVE_PWD_H 1
# | #define HAVE_STDBOOL_H 1
# | #define TIME_WITH_SYS_TIME 1
# | #define HAVE_PTRDIFF_T 1
# | #define HAVE_A2_STRUCT_TIMESPEC 1
# | #define HAVE_ICONV 1
# | #define HAVE_SYS_TIME_H 1
# | #define HAVE_UNISTD_H 1
# | #define HAVE_ALARM 1
# | #define HAVE_SYS_SELECT_H 1
# | #define HAVE_SYS_SOCKET_H 1
# | #define SELECT_TYPE_ARG1 int
# | #define SELECT_TYPE_ARG234 (fd_set *)
# | #define SELECT_TYPE_ARG5 (struct timeval *)
# | #define LSTAT_FOLLOWS_SLASHED_SYMLINK 1
# | #define HAVE_STRFTIME 1
# | #define HAVE_VPRINTF 1
# | #define HAVE_FORK 1
# | #define HAVE_VFORK 1
# | #define HAVE_WORKING_VFORK 1
# | #define HAVE_WORKING_FORK 1
# | /* end confdefs.h. */
# | /* Define __argz_stringify to an innocuous variant, in case declares __argz_stringify.
# | For example, HP-UX 11i declares gettimeofday. */
# | #define __argz_stringify innocuous___argz_stringify
# |
# | /* System header to define __stub macros and hopefully few prototypes,
# | which can conflict with char __argz_stringify (); below.
# | Prefer to if __STDC__ is defined, since
# | exists even on freestanding compilers. */
# |
# | #ifdef __STDC__
# | # include
# | #else
# | # include
# | #endif
# |
# | #undef __argz_stringify
# |
# | /* Override any GCC internal prototype to avoid an error.
# | Use char because int might match the return type of a GCC
# | builtin and then its argument prototype would still apply. */
# | #ifdef __cplusplus
# | extern "C"
# | #endif
# | char __argz_stringify ();
# | /* The GNU C library defines this for functions which it implements
# | to always fail with ENOSYS. Some functions are actually named
# | something starting with __ and the normal name is an alias. */
# | #if defined __stub___argz_stringify || defined __stub_____argz_stringify
# | choke me
# | #endif
# |
# | int
# | main ()
# | {
# | return __argz_stringify ();
# | ;
# | return 0;
# | }
# configure:25450: result: no
# configure:25450: checking for atexit
# configure:25450: clang++ -o conftest conftest.cpp >&5
# configure:25450: $? = 0
# configure:25450: result: yes
# configure:25450: checking for ftruncate
# configure:25450: clang++ -o conftest conftest.cpp >&5
# configure:25450: $? = 0
# configure:25450: result: yes
# configure:25450: checking for getcwd
# configure:25450: clang++ -o conftest conftest.cpp >&5
# configure:25450: $? = 0
# configure:25450: result: yes
# configure:25450: checking for gethostbyaddr
# configure:25450: clang++ -o conftest conftest.cpp >&5
# configure:25450: $? = 0
# configure:25450: result: yes
# configure:25450: checking for gethostbyname
# configure:25450: clang++ -o conftest conftest.cpp >&5
# configure:25450: $? = 0
# configure:25450: result: yes
# configure:25450: checking for getifaddrs
# configure:25450: clang++ -o conftest conftest.cpp >&5
# configure:25450: $? = 0
# configure:25450: result: yes
# configure:25450: checking for getpagesize
# configure:25450: clang++ -o conftest conftest.cpp >&5
# configure:25450: $? = 0
# configure:25450: result: yes
# configure:25450: checking for getrandom
# configure:25450: clang++ -o conftest conftest.cpp >&5
# /tmp/conftest-776792.o:conftest.cpp:function main: error: undefined reference to 'getrandom'
# clang-3.8: error: linker command failed with exit code 1 (use -v to see invocation)
# configure:25450: $? = 1
# configure: failed program was:
# | /* confdefs.h */
# | #define PACKAGE_NAME "aria2"
# | #define PACKAGE_TARNAME "aria2"
# | #define PACKAGE_VERSION "1.24.0"
# | #define PACKAGE_STRING "aria2 1.24.0"
# | #define PACKAGE_BUGREPORT "https://github.com/aria2/aria2/issues"
# | #define PACKAGE_URL "https://aria2.github.io/"
# | #define PACKAGE "aria2"
# | #define VERSION "1.24.0"
# | #define STDC_HEADERS 1
# | #define HAVE_SYS_TYPES_H 1
# | #define HAVE_SYS_STAT_H 1
# | #define HAVE_STDLIB_H 1
# | #define HAVE_STRING_H 1
# | #define HAVE_MEMORY_H 1
# | #define HAVE_STRINGS_H 1
# | #define HAVE_INTTYPES_H 1
# | #define HAVE_STDINT_H 1
# | #define HAVE_UNISTD_H 1
# | #define __EXTENSIONS__ 1
# | #define _ALL_SOURCE 1
# | #define _GNU_SOURCE 1
# | #define _POSIX_PTHREAD_SEMANTICS 1
# | #define _TANDEM_SOURCE 1
# | #define HAVE_DLFCN_H 1
# | #define LT_OBJDIR ".libs/"
# | #define BUILD "x86_64-pc-linux-gnu"
# | #define HOST "x86_64-unknown-linux-gnu"
# | #define TARGET "x86_64-unknown-linux-gnu"
# | #define CA_BUNDLE "/etc/ssl/certs/ca-certificates.crt"
# | #define CXX11_OVERRIDE override
# | #define HAVE_ZLIB 1
# | #define HAVE_SQLITE3 1
# | #define HAVE_LIBGNUTLS 1
# | #define HAVE_LIBGCRYPT 1
# | #define HAVE_LIBSSH2 1
# | #define HAVE_LIBCARES 1
# | #define HAVE_ARES_ADDR_NODE 1
# | #define HAVE_ARES_SET_SERVERS 1
# | #define USE_LIBGCRYPT_MD 1
# | #define ENABLE_SSL 1
# | #define ENABLE_BITTORRENT 1
# | #define ENABLE_ASYNC_DNS 1
# | #define HAVE_ALLOCA_H 1
# | #define HAVE_ALLOCA 1
# | #define STDC_HEADERS 1
# | #define HAVE_ARPA_INET_H 1
# | #define HAVE_FCNTL_H 1
# | #define HAVE_FLOAT_H 1
# | #define HAVE_INTTYPES_H 1
# | #define HAVE_LANGINFO_H 1
# | #define HAVE_LIBINTL_H 1
# | #define HAVE_LIMITS_H 1
# | #define HAVE_LOCALE_H 1
# | #define HAVE_MALLOC_H 1
# | #define HAVE_NETDB_H 1
# | #define HAVE_NETINET_IN_H 1
# | #define HAVE_NETINET_TCP_H 1
# | #define HAVE_POLL_H 1
# | #define HAVE_SIGNAL_H 1
# | #define HAVE_STDDEF_H 1
# | #define HAVE_STDINT_H 1
# | #define HAVE_STDIO_EXT_H 1
# | #define HAVE_STDLIB_H 1
# | #define HAVE_STRING_H 1
# | #define HAVE_STRINGS_H 1
# | #define HAVE_SYS_IOCTL_H 1
# | #define HAVE_SYS_PARAM_H 1
# | #define HAVE_SYS_RESOURCE_H 1
# | #define HAVE_SYS_SIGNAL_H 1
# | #define HAVE_SYS_SOCKET_H 1
# | #define HAVE_SYS_TIME_H 1
# | #define HAVE_SYS_TYPES_H 1
# | #define HAVE_SYS_UIO_H 1
# | #define HAVE_SYS_UTSNAME_H 1
# | #define HAVE_TERMIOS_H 1
# | #define HAVE_UNISTD_H 1
# | #define HAVE_UTIME_H 1
# | #define HAVE_WCHAR_H 1
# | #define HAVE_IFADDRS_H 1
# | #define HAVE_PWD_H 1
# | #define HAVE_STDBOOL_H 1
# | #define TIME_WITH_SYS_TIME 1
# | #define HAVE_PTRDIFF_T 1
# | #define HAVE_A2_STRUCT_TIMESPEC 1
# | #define HAVE_ICONV 1
# | #define HAVE_SYS_TIME_H 1
# | #define HAVE_UNISTD_H 1
# | #define HAVE_ALARM 1
# | #define HAVE_SYS_SELECT_H 1
# | #define HAVE_SYS_SOCKET_H 1
# | #define SELECT_TYPE_ARG1 int
# | #define SELECT_TYPE_ARG234 (fd_set *)
# | #define SELECT_TYPE_ARG5 (struct timeval *)
# | #define LSTAT_FOLLOWS_SLASHED_SYMLINK 1
# | #define HAVE_STRFTIME 1
# | #define HAVE_VPRINTF 1
# | #define HAVE_FORK 1
# | #define HAVE_VFORK 1
# | #define HAVE_WORKING_VFORK 1
# | #define HAVE_WORKING_FORK 1
# | #define HAVE_ATEXIT 1
# | #define HAVE_FTRUNCATE 1
# | #define HAVE_GETCWD 1
# | #define HAVE_GETHOSTBYADDR 1
# | #define HAVE_GETHOSTBYNAME 1
# | #define HAVE_GETIFADDRS 1
# | #define HAVE_GETPAGESIZE 1
# | /* end confdefs.h. */
# | /* Define getrandom to an innocuous variant, in case declares getrandom.
# | For example, HP-UX 11i declares gettimeofday. */
# | #define getrandom innocuous_getrandom
# |
# | /* System header to define __stub macros and hopefully few prototypes,
# | which can conflict with char getrandom (); below.
# | Prefer to if __STDC__ is defined, since
# | exists even on freestanding compilers. */
# |
# | #ifdef __STDC__
# | # include
# | #else
# | # include
# | #endif
# |
# | #undef getrandom
# |
# | /* Override any GCC internal prototype to avoid an error.
# | Use char because int might match the return type of a GCC
# | builtin and then its argument prototype would still apply. */
# | #ifdef __cplusplus
# | extern "C"
# | #endif
# | char getrandom ();
# | /* The GNU C library defines this for functions which it implements
# | to always fail with ENOSYS. Some functions are actually named
# | something starting with __ and the normal name is an alias. */
# | #if defined __stub_getrandom || defined __stub___getrandom
# | choke me
# | #endif
# |
# | int
# | main ()
# | {
# | return getrandom ();
# | ;
# | return 0;
# | }
# configure:25450: result: no
# configure:25450: checking for memchr
# configure:25450: clang++ -o conftest conftest.cpp >&5
# configure:25450: $? = 0
# configure:25450: result: yes
# configure:25450: checking for memmove
# configure:25450: clang++ -o conftest conftest.cpp >&5
# configure:25450: $? = 0
# configure:25450: result: yes
# configure:25450: checking for mempcpy
# configure:25450: clang++ -o conftest conftest.cpp >&5
# configure:25450: $? = 0
# configure:25450: result: yes
# configure:25450: checking for memset
# configure:25450: clang++ -o conftest conftest.cpp >&5
# configure:25450: $? = 0
# configure:25450: result: yes
# configure:25450: checking for mkdir
# configure:25450: clang++ -o conftest conftest.cpp >&5
# configure:25450: $? = 0
# configure:25450: result: yes
# configure:25450: checking for mmap
# configure:25450: clang++ -o conftest conftest.cpp >&5
# configure:25450: $? = 0
# configure:25450: result: yes
# configure:25450: checking for munmap
# configure:25450: clang++ -o conftest conftest.cpp >&5
# configure:25450: $? = 0
# configure:25450: result: yes
# configure:25450: checking for nl_langinfo
# configure:25450: clang++ -o conftest conftest.cpp >&5
# configure:25450: $? = 0
# configure:25450: result: yes
# configure:25450: checking for posix_fadvise
# configure:25450: clang++ -o conftest conftest.cpp >&5
# configure:25450: $? = 0
# configure:25450: result: yes
# configure:25450: checking for posix_memalign
# configure:25450: clang++ -o conftest conftest.cpp >&5
# configure:25450: $? = 0
# configure:25450: result: yes
# configure:25450: checking for pow
# configure:25450: clang++ -o conftest conftest.cpp >&5
# configure:25450: $? = 0
# configure:25450: result: yes
# configure:25450: checking for putenv
# configure:25450: clang++ -o conftest conftest.cpp >&5
# configure:25450: $? = 0
# configure:25450: result: yes
# configure:25450: checking for rmdir
# configure:25450: clang++ -o conftest conftest.cpp >&5
# configure:25450: $? = 0
# configure:25450: result: yes
# configure:25450: checking for select
# configure:25450: clang++ -o conftest conftest.cpp >&5
# configure:25450: $? = 0
# configure:25450: result: yes
# configure:25450: checking for setlocale
# configure:25450: clang++ -o conftest conftest.cpp >&5
# configure:25450: $? = 0
# configure:25450: result: yes
# configure:25450: checking for sigaction
# configure:25450: clang++ -o conftest conftest.cpp >&5
# configure:25450: $? = 0
# configure:25450: result: yes
# configure:25450: checking for sleep
# configure:25450: clang++ -o conftest conftest.cpp >&5
# configure:25450: $? = 0
# configure:25450: result: yes
# configure:25450: checking for socket
# configure:25450: clang++ -o conftest conftest.cpp >&5
# configure:25450: $? = 0
# configure:25450: result: yes
# configure:25450: checking for stpcpy
# configure:25450: clang++ -o conftest conftest.cpp >&5
# configure:25450: $? = 0
# configure:25450: result: yes
# configure:25450: checking for strcasecmp
# configure:25450: clang++ -o conftest conftest.cpp >&5
# configure:25450: $? = 0
# configure:25450: result: yes
# configure:25450: checking for strchr
# configure:25450: clang++ -o conftest conftest.cpp >&5
# configure:25450: $? = 0
# configure:25450: result: yes
# configure:25450: checking for strcspn
# configure:25450: clang++ -o conftest conftest.cpp >&5
# configure:25450: $? = 0
# configure:25450: result: yes
# configure:25450: checking for strdup
# configure:25450: clang++ -o conftest conftest.cpp >&5
# configure:25450: $? = 0
# configure:25450: result: yes
# configure:25450: checking for strerror
# configure:25450: clang++ -o conftest conftest.cpp >&5
# configure:25450: $? = 0
# configure:25450: result: yes
# configure:25450: checking for strncasecmp
# configure:25450: clang++ -o conftest conftest.cpp >&5
# configure:25450: $? = 0
# configure:25450: result: yes
# configure:25450: checking for strstr
# configure:25450: clang++ -o conftest conftest.cpp >&5
# configure:25450: $? = 0
# configure:25450: result: yes
# configure:25450: checking for strtol
# configure:25450: clang++ -o conftest conftest.cpp >&5
# configure:25450: $? = 0
# configure:25450: result: yes
# configure:25450: checking for strtoul
# configure:25450: clang++ -o conftest conftest.cpp >&5
# configure:25450: $? = 0
# configure:25450: result: yes
# configure:25450: checking for strtoull
# configure:25450: clang++ -o conftest conftest.cpp >&5
# configure:25450: $? = 0
# configure:25450: result: yes
# configure:25450: checking for tzset
# configure:25450: clang++ -o conftest conftest.cpp >&5
# configure:25450: $? = 0
# configure:25450: result: yes
# configure:25450: checking for unsetenv
# configure:25450: clang++ -o conftest conftest.cpp >&5
# configure:25450: $? = 0
# configure:25450: result: yes
# configure:25450: checking for usleep
# configure:25450: clang++ -o conftest conftest.cpp >&5
# configure:25450: $? = 0
# configure:25450: result: yes
# configure:25450: checking for utime
# configure:25450: clang++ -o conftest conftest.cpp >&5
# configure:25450: $? = 0
# configure:25450: result: yes
# configure:25450: checking for utimes
# configure:25450: clang++ -o conftest conftest.cpp >&5
# configure:25450: $? = 0
# configure:25450: result: yes
# configure:25460: checking for getrandom linux syscall interface
# configure:25479: clang++ -o conftest conftest.cpp >&5
# conftest.cpp:146:10: fatal error: 'linux/random.h' file not found
# #include
# ^
# 1 error generated.
# configure:25479: $? = 1
# configure: failed program was:
# | /* confdefs.h */
# | #define PACKAGE_NAME "aria2"
# | #define PACKAGE_TARNAME "aria2"
# | #define PACKAGE_VERSION "1.24.0"
# | #define PACKAGE_STRING "aria2 1.24.0"
# | #define PACKAGE_BUGREPORT "https://github.com/aria2/aria2/issues"
# | #define PACKAGE_URL "https://aria2.github.io/"
# | #define PACKAGE "aria2"
# | #define VERSION "1.24.0"
# | #define STDC_HEADERS 1
# | #define HAVE_SYS_TYPES_H 1
# | #define HAVE_SYS_STAT_H 1
# | #define HAVE_STDLIB_H 1
# | #define HAVE_STRING_H 1
# | #define HAVE_MEMORY_H 1
# | #define HAVE_STRINGS_H 1
# | #define HAVE_INTTYPES_H 1
# | #define HAVE_STDINT_H 1
# | #define HAVE_UNISTD_H 1
# | #define __EXTENSIONS__ 1
# | #define _ALL_SOURCE 1
# | #define _GNU_SOURCE 1
# | #define _POSIX_PTHREAD_SEMANTICS 1
# | #define _TANDEM_SOURCE 1
# | #define HAVE_DLFCN_H 1
# | #define LT_OBJDIR ".libs/"
# | #define BUILD "x86_64-pc-linux-gnu"
# | #define HOST "x86_64-unknown-linux-gnu"
# | #define TARGET "x86_64-unknown-linux-gnu"
# | #define CA_BUNDLE "/etc/ssl/certs/ca-certificates.crt"
#