Build of ttyload with android toolchain

The build took 00h 01m 05s and was NOT successful.

The program in this build is written in the following languages, according to sloccount:

SLOCLanguage
675 ansic
49 makefile
36 sh
760 total

The process tree of the build process is here.

Several sub-process invocations were improper; see the process tree for details. Summary:

List of Errors

Log

To avoid scrolling, you may jump to the last line of the invocation of makepkg that was used to build this package.

Removed vanilla repositories from pacman.conf and added:
# [tuscan]
# Server = file:///var/cache/pacman/pkg/

CMD: pacman -Syy --noconfirm
# :: Synchronizing package databases...
# downloading tuscan.db...

Copied permanent toolchain into container-local sysroot
# /toolchain_root/arm-linux-androideabi --> /sysroot/arm-linux-androideabi
# /toolchain_root/COPYING3.LIB --> /sysroot/COPYING3.LIB
# /toolchain_root/sysroot --> /sysroot/sysroot
# /toolchain_root/COPYING.RUNTIME --> /sysroot/COPYING.RUNTIME
# /toolchain_root/lib --> /sysroot/lib
# /toolchain_root/SOURCES --> /sysroot/SOURCES
# /toolchain_root/lib64 --> /sysroot/lib64
# /toolchain_root/share --> /sysroot/share
# /toolchain_root/bin --> /sysroot/bin
# /toolchain_root/COPYING --> /sysroot/COPYING
# /toolchain_root/COPYING3 --> /sysroot/COPYING3
# /toolchain_root/COPYING.LIB --> /sysroot/COPYING.LIB
# /toolchain_root/include --> /sysroot/include
# /toolchain_root/libexec --> /sysroot/libexec

CMD: sudo -u tuscan PATH=/sysroot/bin:/sysroot/libexec/gcc/arm-linux-androideabi/4.8:/usr/local/sbin:/usr/local/bin:/usr/sbin:/usr/bin:/sbin:/bin CC=arm-linux-androideabi-gcc CXX=arm-linux-androideabi-g++ red makepkg --noextract --syncdeps --skipinteg --skippgpcheck --skipchecksums --noconfirm --nocolor --log --noprogressbar --nocheck
# ==> Making package: ttyload 0.5.3-1 (Tue Apr 4 20:37:52 UTC 2017)
# ==> Checking runtime dependencies...
# ==> Checking buildtime dependencies...
# ==> WARNING: Using existing $srcdir/ tree
# ==> Starting build()...
# ln -s FreeBSD arch/Darwin
# ln -s FreeBSD arch/Isilon-OneFS
# ln -s `uname -s | sed -e 's/ /-/g'` arch/thisarch
# make archtest ttyload ARCH=`uname -s | sed -e 's/ /-/g'`
# make[1]: warning: jobserver unavailable: using -j1. Add '+' to parent make rule.
# make[1]: Entering directory '/tmp/ttyload/src/ttyload-0.5.3'
# gcc -pedantic -Wall -Werror -I${PWD:-.} -I${PWD:-.}/arch/Linux -I${PWD:-.}/arch/default -g -DVERSION='"'`cat Version`'"' -o arch/Linux/getload.o -c arch/Linux/getload.c
# In file included from arch/Linux/getload.c:7:0:
# /tmp/ttyload/src/ttyload-0.5.3/ttyload.h:10:18: fatal error: time.h: No such file or directory
# #include
# ^
# compilation terminated.
# make[1]: *** [Makefile:92: arch/Linux/getload.o] Error 1
# make[1]: Leaving directory '/tmp/ttyload/src/ttyload-0.5.3'
# make: *** [Makefile:65: archbuild] Error 2
# ==> ERROR: A failure occurred in build().
# Aborting...