The build took 00h 01m 05s and was NOT successful.
The program in this build is written in the following languages, according to sloccount:
SLOC | Language |
---|---|
6,237 |
ansic |
277 |
makefile |
6,514 |
total |
The process tree of the build process is here.
Several sub-process invocations were improper; see the process tree for details. Summary:
To avoid scrolling, you may jump to the last line of the
invocation of makepkg
that was used to build this
package.
Removed vanilla repositories from pacman.conf and added:
Copied permanent toolchain into container-local sysroot
/toolchain_root/arm-linux-androideabi --> /sysroot/arm-linux-androideabi
/toolchain_root/COPYING3.LIB --> /sysroot/COPYING3.LIB
/toolchain_root/sysroot --> /sysroot/sysroot
/toolchain_root/COPYING.RUNTIME --> /sysroot/COPYING.RUNTIME
/toolchain_root/lib --> /sysroot/lib
/toolchain_root/SOURCES --> /sysroot/SOURCES
/toolchain_root/lib64 --> /sysroot/lib64
/toolchain_root/share --> /sysroot/share
/toolchain_root/bin --> /sysroot/bin
/toolchain_root/COPYING --> /sysroot/COPYING
/toolchain_root/COPYING3 --> /sysroot/COPYING3
/toolchain_root/COPYING.LIB --> /sysroot/COPYING.LIB
/toolchain_root/include --> /sysroot/include
/toolchain_root/libexec --> /sysroot/libexec
CMD: sudo -u tuscan PATH=/sysroot/bin:/sysroot/libexec/gcc/arm-linux-androideabi/4.8:/usr/local/sbin:/usr/local/bin:/usr/sbin:/usr/bin:/sbin:/bin CC=arm-linux-androideabi-gcc CXX=arm-linux-androideabi-g++ red makepkg --noextract --syncdeps --skipinteg --skippgpcheck --skipchecksums --noconfirm --nocolor --log --noprogressbar --nocheck
==> Making package: gsm 1.0.14-1 (Tue Apr 4 21:11:54 UTC 2017)
==> Checking runtime dependencies...
==> Checking buildtime dependencies...
==> WARNING: Using existing $srcdir/ tree
==> Starting build()...
patching file Makefile
gcc -ansi -pedantic -c -fPIC -DSASR -DWAV49 -I./inc src/add.c
gcc -ansi -pedantic -c -fPIC -DSASR -DWAV49 -I./inc src/code.c
gcc -ansi -pedantic -c -fPIC -DSASR -DWAV49 -I./inc src/debug.c
gcc -ansi -pedantic -c -fPIC -DSASR -DWAV49 -I./inc src/decode.c
src/add.c:13:19: fatal error: stdio.h: No such file or directory
#include
^
compilation terminated.
make: *** [Makefile:277: src/add.o] Error 1
make: *** Waiting for unfinished jobs....
src/decode.c:9:19: fatal error: stdio.h: No such file or directory
#include
^
compilation terminated.
src/code.c:13:20: fatal error: string.h: No such file or directory
#include
^
compilation terminated.
src/debug.c:18:19: fatal error: stdio.h: No such file or directory
#include
^
compilation terminated.
make: *** [Makefile:277: src/code.o] Error 1
make: *** [Makefile:277: src/decode.o] Error 1
make: *** [Makefile:277: src/debug.o] Error 1
==> ERROR: A failure occurred in build().
Aborting...